program: Orca
programVersion: 5.0.2
elementType: O O O C C C C C C C C C C C C C C C C C C C C C C H H H H H H H H H H H H H H H H H H H H H H H H H H
charge: 0
multiplicity: 1
keywords: wb97x-d3
keywords: def2-TZVPP
keywords: def2/J RIJCOSX
keywords: DEFGRID2
keywords: scfconv7
keywords: smallprint printgap noloewdin
keywords: NOSOSCF
formula: C22H26O3
InChI: InChI=1/C22H26O3/c1-15(2)10-19-20(22(19,3)4)21(23)25-14-17-12-18(24-13-17)11-16-8-6-5-7-9-16/h5-10,12-13,19-20H,11,14H2,1-4H3
51 atoms
O  1.668241 -1.846387 -0.66073
O  1.984658 -1.710089 1.548079
O  -2.562534 -2.424017 -0.589744
C  1.313849 1.247032 -0.182144
C  2.46338 0.90538 -1.089442
C  2.352263 0.220565 0.246905
C  1.331257 2.558315 0.563887
C  -0.077305 0.812853 -0.577828
C  3.583772 1.852806 -1.314845
C  1.991389 -1.197428 0.452073
C  3.745186 2.615541 -2.39954
C  4.914481 3.543239 -2.529975
C  2.79288 2.633114 -3.555367
C  1.01727 -3.127444 -0.5447
C  -0.426594 -2.922531 -0.25526
C  -1.047636 -2.653945 1.007373
C  -1.402781 -2.770149 -1.181824
C  -2.338914 -2.345827 0.743579
C  -3.431387 -1.803495 1.594711
C  -3.358801 -0.293241 1.606668
C  -3.902913 0.455471 0.56623
C  -2.665934 0.366935 2.617388
C  -3.751617 1.835287 0.535067
C  -2.51506 1.746858 2.589773
C  -3.054412 2.485107 1.544837
H  2.1852 0.302098 -1.947771
H  3.02644 0.574882 1.020549
H  0.977195 3.368468 -0.077878
H  2.324842 2.829664 0.919938
H  0.669733 2.514246 1.431959
H  -0.679423 0.566896 0.299881
H  -0.086534 -0.045219 -1.247086
H  -0.579755 1.630784 -1.098775
H  4.322565 1.928367 -0.521546
H  5.500959 3.317129 -3.424671
H  4.582066 4.579786 -2.634842
H  5.58186 3.49065 -1.669559
H  3.302605 2.368035 -4.485547
H  1.94861 1.956852 -3.432165
H  2.38996 3.638735 -3.703366
H  1.509852 -3.745719 0.205722
H  1.157994 -3.598431 -1.516123
H  -0.586026 -2.666516 1.981523
H  -1.4137 -2.87329 -2.256222
H  -3.311679 -2.191258 2.60703
H  -4.404339 -2.142238 1.231703
H  -4.448294 -0.041357 -0.227795
H  -2.234212 -0.204631 3.431053
H  -4.178769 2.404059 -0.281298
H  -1.973509 2.244947 3.384231
H  -2.934955 3.560718 1.519205
elementType: O C H
totalener: -1079.74924533 hartree
nucrepener: 2208.58418960 hartree
electener: -3288.33343493 hartree
oneelecener: -5856.42283333 hartree
twoeener: 2568.08939841 hartree
cpcmener: -0.02524030 hartree
kineticenergy: 1074.85893449 hartree
xcener: -106.461347923426 hartree
chargesum: 0.0000000
charge: -0.273793 -0.468052 -0.271349 0.221018 0.014638 -0.143212 -0.284366 -0.319248 -0.285911 0.400535 -0.029370 -0.229623 -0.252184 0.051833 -0.075771 -0.308613 -0.035975 0.205982 -0.052419 0.044001 -0.198377 -0.166817 -0.152894 -0.168259 -0.169779 0.103308 0.091855 0.095506 0.093024 0.094052 0.061878 0.097986 0.104660 0.119082 0.093647 0.093533 0.088722 0.098012 0.086893 0.095811 0.119977 0.117331 0.156935 0.173732 0.107132 0.111157 0.136925 0.138205 0.155640 0.156366 0.156634
qa: -0.2738 -0.4681 -0.2713 0.2210 0.0146 -0.1432 -0.2844 -0.3192 -0.2859 0.4005 -0.0294 -0.2296 -0.2522 0.0518 -0.0758 -0.3086 -0.0360 0.2060 -0.0524 0.0440 -0.1984 -0.1668 -0.1529 -0.1683 -0.1698 0.1033 0.0919 0.0955 0.0930 0.0941 0.0619 0.0980 0.1047 0.1191 0.0936 0.0935 0.0887 0.0980 0.0869 0.0958 0.1200 0.1173 0.1569 0.1737 0.1071 0.1112 0.1369 0.1382 0.1556 0.1564 0.1566
va: 2.1132 2.0308 2.2739 3.5758 3.7666 3.9052 3.9088 3.9246 3.8596 4.1988 3.7089 3.9282 3.9428 3.8655 3.6626 3.9527 3.9376 3.6323 3.8204 3.6074 3.9245 3.8858 3.8793 3.8731 3.8599 1.0183 1.0347 1.0016 1.0046 1.0039 1.0096 1.0200 1.0017 1.0082 0.9957 0.9960 1.0080 0.9982 1.0089 0.9974 1.0080 0.9989 1.0208 0.9949 1.0119 1.0132 1.0108 1.0040 0.9913 0.9919 0.9911
dispcorr: -0.028150253 hartree
energy: -1079.777395580892
dipole: 11.84268 -12.26839 -0.42571 22.04251 -21.43860 0.60391 -9.79846 8.71459 -1.08387
magnitude: 1.31176 au
magnitude: 3.33423 debye
