program: Orca
programVersion: 5.0.2
elementType: O O O C C C C C C C C C C C C C C C C C C C C C C H H H H H H H H H H H H H H H H H H H H H H H H H H
charge: 0
multiplicity: 1
keywords: wb97x-d3
keywords: def2-TZVPP
keywords: def2/J RIJCOSX
keywords: DEFGRID2
keywords: scfconv7
keywords: smallprint printgap noloewdin
keywords: NOSOSCF
formula: C22H26O3
InChI: InChI=1/C22H26O3/c1-15(2)10-19-20(22(19,3)4)21(23)25-14-17-12-18(24-13-17)11-16-8-6-5-7-9-16/h5-10,12-13,19-20H,11,14H2,1-4H3
51 atoms
O  1.742617 -2.291195 -0.963185
O  2.306619 -1.726558 1.126291
O  -2.579694 -2.449583 -0.473286
C  4.091298 0.435982 -0.283654
C  2.781515 1.035676 0.119835
C  2.806157 -0.255625 -0.694383
C  4.883837 1.054171 -1.41181
C  4.974661 -0.151205 0.790005
C  2.220316 2.257438 -0.483368
C  2.285483 -1.4786 -0.057732
C  1.397437 3.133963 0.104708
C  0.91319 4.34215 -0.640168
C  0.886545 3.030784 1.509942
C  0.949271 -3.398852 -0.500381
C  -0.431599 -2.937268 -0.197645
C  -0.889907 -2.178736 0.930477
C  -1.507416 -3.064762 -1.009322
C  -2.195419 -1.904661 0.705848
C  -3.190807 -1.084985 1.439383
C  -3.555565 0.175679 0.686947
C  -2.563262 1.051029 0.247607
C  -4.884471 0.485017 0.420759
C  -2.894742 2.207058 -0.442596
C  -5.219859 1.643807 -0.269497
C  -4.226135 2.507615 -0.704663
H  2.534778 0.873924 1.163249
H  2.552354 -0.15582 -1.743772
H  4.263698 1.371699 -2.249387
H  5.609389 0.337375 -1.801462
H  5.438434 1.926164 -1.058641
H  4.422336 -0.501001 1.658841
H  5.681592 0.605985 1.135558
H  5.557352 -0.988951 0.400742
H  2.499978 2.452492 -1.514333
H  -0.179096 4.356185 -0.697317
H  1.205214 5.263261 -0.127997
H  1.302647 4.386427 -1.65735
H  1.186978 2.121516 2.026828
H  1.230574 3.879502 2.107722
H  -0.206016 3.0716 1.524553
H  1.421088 -3.883185 0.354924
H  0.943943 -4.108463 -1.326598
H  -0.320368 -1.867111 1.791044
H  -1.649792 -3.553005 -1.961474
H  -2.75944 -0.83066 2.410306
H  -4.09463 -1.665144 1.64345
H  -1.519758 0.825275 0.439084
H  -5.667186 -0.186969 0.753051
H  -2.111695 2.874336 -0.781267
H  -6.2602 1.867236 -0.469684
H  -4.48466 3.408416 -1.24652
elementType: O C H
totalener: -1079.75320911 hartree
nucrepener: 2160.83765995 hartree
electener: -3240.59086906 hartree
oneelecener: -5760.79775019 hartree
twoeener: 2520.20688113 hartree
cpcmener: -0.02477957 hartree
kineticenergy: 1074.85472210 hartree
xcener: -106.460722105039 hartree
chargesum: 0.0000000
charge: -0.286703 -0.480134 -0.277441 0.102949 0.018090 -0.071115 -0.280207 -0.273457 -0.257239 0.401400 -0.060892 -0.214826 -0.260195 0.078170 -0.085865 -0.306298 -0.038159 0.199974 -0.045990 0.024532 -0.210324 -0.186661 -0.139226 -0.138735 -0.196842 0.096874 0.088162 0.089894 0.096091 0.099984 0.091947 0.094051 0.096878 0.114677 0.083891 0.098601 0.088810 0.095186 0.106799 0.083836 0.116781 0.117412 0.163719 0.173658 0.113338 0.102743 0.148204 0.138594 0.174645 0.155313 0.155107
qa: -0.2867 -0.4801 -0.2774 0.1029 0.0181 -0.0711 -0.2802 -0.2735 -0.2572 0.4014 -0.0609 -0.2148 -0.2602 0.0782 -0.0859 -0.3063 -0.0382 0.2000 -0.0460 0.0245 -0.2103 -0.1867 -0.1392 -0.1387 -0.1968 0.0969 0.0882 0.0899 0.0961 0.1000 0.0919 0.0941 0.0969 0.1147 0.0839 0.0986 0.0888 0.0952 0.1068 0.0838 0.1168 0.1174 0.1637 0.1737 0.1133 0.1027 0.1482 0.1386 0.1746 0.1553 0.1551
va: 2.1169 2.0211 2.2778 3.7133 3.7921 3.8011 3.9155 3.8948 3.8769 4.1672 3.7647 3.9187 3.9365 3.8414 3.6936 3.9758 3.9711 3.6455 3.8278 3.6725 3.9400 3.9378 3.8635 3.8872 3.9482 1.0268 1.0355 1.0069 1.0016 1.0003 1.0214 0.9998 0.9996 1.0123 0.9976 0.9967 1.0089 1.0096 0.9994 0.9988 1.0106 0.9975 1.0168 0.9952 1.0045 1.0106 0.9942 1.0037 0.9750 0.9910 0.9935
dispcorr: -0.024599721 hartree
energy: -1079.777808828306
dipole: 15.60968 -15.69623 -0.08655 20.32225 -19.88051 0.44174 0.79742 -1.33765 -0.54023
magnitude: 0.70319 au
magnitude: 1.78736 debye
