program: Orca
programVersion: 5.0.2
elementType: O O O C C C C C C C C C C C C C C C C C C C C C C H H H H H H H H H H H H H H H H H H H H H H H H H H
charge: 0
multiplicity: 1
keywords: wb97x-d3
keywords: def2-TZVPP
keywords: def2/J RIJCOSX
keywords: DEFGRID2
keywords: scfconv7
keywords: smallprint printgap noloewdin
keywords: NOSOSCF
formula: C22H26O3
InChI: InChI=1/C22H26O3/c1-15(2)10-19-20(22(19,3)4)21(23)25-14-17-12-18(24-13-17)11-16-8-6-5-7-9-16/h5-10,12-13,19-20H,11,14H2,1-4H3
51 atoms
O  1.581573 -1.899539 -0.33344
O  0.837657 -0.651543 -2.033002
O  -2.366163 -2.616601 1.291979
C  1.770423 1.605567 -0.002155
C  2.643531 1.549648 -1.210966
C  2.367963 0.275169 -0.446256
C  2.330345 2.167757 1.281622
C  0.292814 1.867016 -0.166507
C  4.012392 2.12994 -1.226239
C  1.516993 -0.773012 -1.039679
C  5.051999 1.619049 -1.890768
C  6.396951 2.278519 -1.868032
C  4.973964 0.36242 -2.70169
C  0.689822 -2.974365 -0.679312
C  -0.673961 -2.722899 -0.140039
C  -1.757145 -2.005795 -0.746175
C  -1.112034 -3.06754 1.094126
C  -2.754468 -1.968825 0.16765
C  -4.077963 -1.294689 0.191635
C  -4.027101 -0.041509 1.034959
C  -4.464729 -0.045626 2.354817
C  -3.485928 1.129751 0.510062
C  -4.366547 1.099789 3.135649
C  -3.387188 2.274827 1.286539
C  -3.827637 2.262553 2.604272
H  2.106014 1.614757 -2.154456
H  3.165745 -0.096408 0.187654
H  3.3824 1.921009 1.425267
H  1.780564 1.77984 2.141375
H  2.238871 3.256157 1.298636
H  -0.282613 1.363468 0.613015
H  -0.095177 1.546236 -1.131412
H  0.0949 2.937473 -0.077689
H  4.15757 3.053342 -0.671958
H  7.15871 1.599946 -1.474518
H  6.719284 2.550221 -2.876788
H  6.404569 3.182126 -1.258304
H  5.298445 0.547487 -3.729166
H  5.648256 -0.399799 -2.301371
H  3.973419 -0.064653 -2.742729
H  1.131333 -3.855335 -0.21603
H  0.677272 -3.132958 -1.758162
H  -1.785139 -1.572109 -1.732672
H  -0.656616 -3.617115 1.903805
H  -4.846501 -1.973885 0.569008
H  -4.349144 -1.046132 -0.83543
H  -4.887935 -0.949299 2.777777
H  -3.135993 1.145196 -0.51606
H  -4.71163 1.081917 4.161776
H  -2.965365 3.177352 0.862036
H  -3.752291 3.155257 3.212007
elementType: O C H
totalener: -1079.75265782 hartree
nucrepener: 2146.02921145 hartree
electener: -3225.78186927 hartree
oneelecener: -5731.53658385 hartree
twoeener: 2505.75471458 hartree
cpcmener: -0.02381274 hartree
kineticenergy: 1074.86337287 hartree
xcener: -106.460642123380 hartree
chargesum: -0.0000000
charge: -0.281880 -0.474096 -0.275074 0.171161 -0.020948 -0.112987 -0.291110 -0.302448 -0.292457 0.399960 -0.016946 -0.227902 -0.240365 0.069348 -0.069368 -0.332846 -0.037072 0.214054 -0.058660 0.082577 -0.198101 -0.239661 -0.151669 -0.154352 -0.169598 0.104092 0.095027 0.093683 0.098252 0.098413 0.102032 0.092997 0.099217 0.121267 0.093586 0.095346 0.088892 0.099776 0.097826 0.080618 0.118677 0.118332 0.156434 0.173706 0.110019 0.113287 0.138638 0.147690 0.155985 0.159249 0.157401
qa: -0.2819 -0.4741 -0.2751 0.1712 -0.0209 -0.1130 -0.2911 -0.3024 -0.2925 0.4000 -0.0169 -0.2279 -0.2404 0.0693 -0.0694 -0.3328 -0.0371 0.2141 -0.0587 0.0826 -0.1981 -0.2397 -0.1517 -0.1544 -0.1696 0.1041 0.0950 0.0937 0.0983 0.0984 0.1020 0.0930 0.0992 0.1213 0.0936 0.0953 0.0889 0.0998 0.0978 0.0806 0.1187 0.1183 0.1564 0.1737 0.1100 0.1133 0.1386 0.1477 0.1560 0.1592 0.1574
va: 2.1208 2.0283 2.2788 3.7050 3.8203 3.8070 3.9018 3.8944 3.8872 4.1574 3.7130 3.9309 3.9349 3.8524 3.6445 3.9825 3.9699 3.6223 3.8216 3.5422 3.9662 3.9244 3.8961 3.8770 3.9038 1.0260 1.0300 1.0021 1.0032 0.9998 0.9927 1.0167 1.0025 1.0033 0.9967 0.9961 1.0065 0.9999 0.9986 1.0167 0.9966 1.0075 1.0202 0.9942 1.0103 1.0085 1.0061 0.9997 0.9908 0.9892 0.9902
dispcorr: -0.025168932 hartree
energy: -1079.777826751713
dipole: 21.02092 -20.55420 0.46672 15.81423 -15.91309 -0.09887 -3.85559 4.41929 0.56370
magnitude: 0.73848 au
magnitude: 1.87707 debye
