program: Orca
programVersion: 5.0.2
elementType: O O O C C C C C C C C C C C C C C C C C C C C C C H H H H H H H H H H H H H H H H H H H H H H H H H H
charge: 0
multiplicity: 1
keywords: wb97x-d3
keywords: def2-TZVPP
keywords: def2/J RIJCOSX
keywords: DEFGRID2
keywords: scfconv7
keywords: smallprint printgap noloewdin
keywords: NOSOSCF
formula: C22H26O3
InChI: InChI=1/C22H26O3/c1-15(2)10-19-20(22(19,3)4)21(23)25-14-17-12-18(24-13-17)11-16-8-6-5-7-9-16/h5-10,12-13,19-20H,11,14H2,1-4H3
51 atoms
O  1.583978 -1.998885 -0.22797
O  0.930672 -0.822427 -2.014352
O  -2.374586 -2.837642 1.326406
C  1.586112 1.514445 0.0143
C  2.5664 1.474682 -1.112024
C  2.283697 0.205391 -0.332258
C  1.982328 2.131131 1.334562
C  0.119602 1.702086 -0.293621
C  3.900728 2.118074 -1.043201
C  1.534354 -0.893443 -0.968743
C  4.869312 1.973371 -1.952197
C  6.17375 2.699504 -1.822018
C  4.751348 1.094472 -3.159643
C  0.727076 -3.098352 -0.585217
C  -0.648633 -2.867621 -0.067819
C  -1.700432 -2.078728 -0.640239
C  -1.125241 -3.299444 1.123792
C  -2.718943 -2.089875 0.251235
C  -4.01983 -1.370712 0.303647
C  -3.877494 -0.066046 1.053985
C  -3.892165 -0.039427 2.446252
C  -3.668826 1.124018 0.36289
C  -3.695394 1.15072 3.132745
C  -3.475325 2.316521 1.04719
C  -3.483867 2.332619 2.435107
H  2.106785 1.479643 -2.096209
H  3.034552 -0.110603 0.383569
H  1.861957 3.21636 1.305909
H  3.013637 1.917346 1.614904
H  1.343199 1.752824 2.134803
H  -0.501954 1.190248 0.444171
H  -0.165172 1.343096 -1.280584
H  -0.130988 2.764218 -0.250484
H  4.091138 2.770185 -0.19588
H  6.364977 3.325089 -2.698269
H  6.203687 3.340085 -0.940429
H  7.009992 1.99807 -1.757861
H  5.587739 0.391851 -3.202927
H  3.831531 0.512011 -3.185619
H  4.800455 1.68508 -4.078591
H  1.176535 -3.967511 -0.107419
H  0.738653 -3.263499 -1.662803
H  -1.694079 -1.564036 -1.58742
H  -0.70324 -3.923895 1.896475
H  -4.780668 -2.000154 0.771567
H  -4.349484 -1.177379 -0.717882
H  -4.058481 -0.955588 3.000998
H  -3.654913 1.118707 -0.720972
H  -3.707717 1.154928 4.215403
H  -3.316269 3.233801 0.494223
H  -3.329966 3.260981 2.970283
elementType: O C H
totalener: -1079.75220143 hartree
nucrepener: 2153.03983234 hartree
electener: -3232.79203376 hartree
oneelecener: -5745.58188324 hartree
twoeener: 2512.78984948 hartree
cpcmener: -0.02376330 hartree
kineticenergy: 1074.85438561 hartree
xcener: -106.459219083162 hartree
chargesum: -0.0000000
charge: -0.283208 -0.475139 -0.275394 0.177385 -0.059990 -0.069005 -0.301249 -0.291786 -0.260477 0.394576 -0.021683 -0.230807 -0.250587 0.072176 -0.061168 -0.355662 -0.041014 0.236880 -0.052364 0.081786 -0.205764 -0.236426 -0.150645 -0.156280 -0.164457 0.101104 0.091555 0.102806 0.089489 0.099177 0.091417 0.095833 0.100113 0.122782 0.093325 0.088114 0.094161 0.094172 0.080966 0.098216 0.116563 0.117929 0.159118 0.174088 0.113830 0.106303 0.138969 0.139177 0.156496 0.157201 0.157399
qa: -0.2832 -0.4751 -0.2754 0.1774 -0.0600 -0.0690 -0.3012 -0.2918 -0.2605 0.3946 -0.0217 -0.2308 -0.2506 0.0722 -0.0612 -0.3557 -0.0410 0.2369 -0.0524 0.0818 -0.2058 -0.2364 -0.1506 -0.1563 -0.1645 0.1011 0.0916 0.1028 0.0895 0.0992 0.0914 0.0958 0.1001 0.1228 0.0933 0.0881 0.0942 0.0942 0.0810 0.0982 0.1166 0.1179 0.1591 0.1741 0.1138 0.1063 0.1390 0.1392 0.1565 0.1572 0.1574
va: 2.1214 2.0234 2.2796 3.7336 3.8467 3.8163 3.9108 3.8792 3.8837 4.1643 3.7141 3.9299 3.9430 3.8553 3.6595 3.9682 3.9715 3.5956 3.8117 3.5566 3.9632 3.9138 3.9023 3.8526 3.8933 1.0225 1.0325 0.9982 1.0022 1.0024 0.9958 1.0169 1.0027 1.0040 0.9955 1.0074 0.9962 0.9982 1.0173 0.9978 0.9971 1.0086 1.0195 0.9942 1.0112 1.0114 1.0114 1.0055 0.9907 0.9906 0.9898
dispcorr: -0.025223534 hartree
energy: -1079.777424961657
dipole: 19.38713 -19.07831 0.30882 18.08923 -18.05085 0.03839 -4.82549 5.42860 0.60311
magnitude: 0.67866 au
magnitude: 1.72502 debye
