program: Orca
programVersion: 5.0.2
elementType: O O O C C C C C C C C C C C C C C C C C C C C C C H H H H H H H H H H H H H H H H H H H H H H H H H H
charge: 0
multiplicity: 1
keywords: wb97x-d3
keywords: def2-TZVPP
keywords: def2/J RIJCOSX
keywords: DEFGRID2
keywords: scfconv7
keywords: smallprint printgap noloewdin
keywords: NOSOSCF
formula: C22H26O3
InChI: InChI=1/C22H26O3/c1-15(2)10-19-20(22(19,3)4)21(23)25-14-17-12-18(24-13-17)11-16-8-6-5-7-9-16/h5-10,12-13,19-20H,11,14H2,1-4H3
51 atoms
O  1.748647 -2.501202 -0.79126
O  1.960855 -1.560664 1.224668
O  -2.223109 -2.479596 1.158314
C  3.711132 0.558636 -0.279152
C  2.297964 1.052325 -0.223323
C  2.586544 -0.34561 -0.743382
C  4.618436 1.077619 -1.368832
C  4.438426 0.295998 1.016206
C  1.760251 2.067547 -1.156265
C  2.089534 -1.501819 0.024854
C  1.326866 3.287149 -0.821508
C  0.785285 4.223866 -1.859107
C  1.34614 3.838461 0.570948
C  0.977274 -3.579464 -0.239545
C  -0.396723 -3.103742 0.067066
C  -1.292107 -2.462354 -0.848776
C  -1.018353 -3.077387 1.267273
C  -2.378743 -2.095917 -0.131096
C  -3.582454 -1.295955 -0.46838
C  -3.49722 0.100296 0.107647
C  -2.490994 0.970721 -0.308536
C  -4.402819 0.536206 1.067515
C  -2.395761 2.248078 0.220935
C  -4.309765 1.816567 1.601156
C  -3.306475 2.676189 1.180008
H  1.878417 1.068841 0.777778
H  2.517457 -0.465111 -1.819249
H  4.109335 1.190777 -2.325705
H  5.460324 0.399658 -1.522296
H  5.025719 2.0531 -1.094333
H  4.996673 1.188888 1.305557
H  5.158775 -0.517623 0.907041
H  3.774099 0.047633 1.840364
H  1.718817 1.784688 -2.20441
H  0.777928 3.779427 -2.854453
H  -0.237716 4.527111 -1.619437
H  1.374716 5.14367 -1.905567
H  1.990827 4.720386 0.620744
H  0.349795 4.171656 0.873039
H  1.702569 3.132023 1.318486
H  1.461898 -4.008273 0.639204
H  0.974191 -4.336776 -1.023044
H  -1.133094 -2.280728 -1.900556
H  -0.734838 -3.431643 2.246343
H  -4.48872 -1.791045 -0.11064
H  -3.658285 -1.248393 -1.556589
H  -1.770455 0.646705 -1.051414
H  -5.188973 -0.129706 1.40385
H  -1.608184 2.9110 -0.116478
H  -5.02299 2.139413 2.349095
H  -3.232123 3.672781 1.596299
elementType: O C H
totalener: -1079.75245901 hartree
nucrepener: 2183.34467105 hartree
electener: -3263.09713006 hartree
oneelecener: -5806.17977955 hartree
twoeener: 2543.08264949 hartree
cpcmener: -0.02660502 hartree
kineticenergy: 1074.86849717 hartree
xcener: -106.462654708794 hartree
chargesum: -0.0000000
charge: -0.289024 -0.468526 -0.277145 0.152406 0.019271 -0.120201 -0.264364 -0.290141 -0.276560 0.393078 -0.060116 -0.218182 -0.248305 0.100057 -0.074784 -0.344196 -0.024762 0.209681 -0.060725 0.050646 -0.229038 -0.199158 -0.113944 -0.127784 -0.203868 0.098206 0.086116 0.087832 0.097830 0.095968 0.093005 0.098329 0.094217 0.118829 0.088850 0.089667 0.099247 0.103552 0.087608 0.092104 0.113583 0.118868 0.158151 0.173617 0.104907 0.116126 0.142591 0.138533 0.159672 0.155462 0.152813
qa: -0.2890 -0.4685 -0.2771 0.1524 0.0193 -0.1202 -0.2644 -0.2901 -0.2766 0.3931 -0.0601 -0.2182 -0.2483 0.1001 -0.0748 -0.3442 -0.0248 0.2097 -0.0607 0.0506 -0.2290 -0.1992 -0.1139 -0.1278 -0.2039 0.0982 0.0861 0.0878 0.0978 0.0960 0.0930 0.0983 0.0942 0.1188 0.0888 0.0897 0.0992 0.1036 0.0876 0.0921 0.1136 0.1189 0.1582 0.1736 0.1049 0.1161 0.1426 0.1385 0.1597 0.1555 0.1528
va: 2.1116 2.0355 2.2744 3.6858 3.7521 3.8983 3.9059 3.8951 3.8312 4.1604 3.7365 3.9142 3.9393 3.8462 3.6485 3.9869 3.9629 3.6157 3.8341 3.6250 3.9836 3.9527 3.8480 3.8769 3.9431 1.0283 1.0400 1.0040 1.0026 1.0031 1.0007 0.9995 1.0208 1.0093 1.0085 0.9945 0.9963 0.9983 0.9985 1.0080 1.0079 0.9901 1.0104 0.9963 1.0116 1.0053 1.0058 1.0043 0.9819 0.9906 0.9950
dispcorr: -0.025336373 hartree
energy: -1079.777795387719
dipole: 15.03855 -15.02941 0.00914 22.22830 -21.84911 0.37919 -5.18959 4.07302 -1.11657
magnitude: 1.17923 au
magnitude: 2.99737 debye
