program: Orca
programVersion: 5.0.2
elementType: O O O C C C C C C C C C C C C C C C C C C C C C C H H H H H H H H H H H H H H H H H H H H H H H H H H
charge: 0
multiplicity: 1
keywords: wb97x-d3
keywords: def2-TZVPP
keywords: def2/J RIJCOSX
keywords: DEFGRID2
keywords: scfconv7
keywords: smallprint printgap noloewdin
keywords: NOSOSCF
formula: C22H26O3
InChI: InChI=1/C22H26O3/c1-15(2)10-19-20(22(19,3)4)21(23)25-14-17-12-18(24-13-17)11-16-8-6-5-7-9-16/h5-10,12-13,19-20H,11,14H2,1-4H3
51 atoms
O  0.605033 -0.363588 -0.861715
O  1.47892 0.79435 -2.558176
O  -2.731653 -2.929141 0.179042
C  3.450529 1.672969 -0.225628
C  4.12317 0.757107 -1.204936
C  2.791622 0.357097 -0.602587
C  3.964982 1.765275 1.190678
C  2.898433 2.979677 -0.738359
C  5.340416 -0.010693 -0.878155
C  1.587666 0.30727 -1.456293
C  6.429177 -0.139152 -1.644897
C  7.602393 -0.951527 -1.18242
C  6.608419 0.487278 -2.994273
C  -0.614115 -0.54553 -1.603206
C  -1.56678 -1.280419 -0.73546
C  -2.427173 -0.740033 0.274659
C  -1.80163 -2.612708 -0.743526
C  -3.113679 -1.784782 0.795153
C  -4.141147 -1.905093 1.866159
C  -4.846694 -0.599525 2.117368
C  -5.775644 -0.118687 1.196094
C  -4.582858 0.152505 3.256248
C  -6.431485 1.082871 1.413327
C  -5.239038 1.357883 3.477663
C  -6.165158 1.825652 2.557669
H  4.048231 1.096264 -2.232348
H  2.817696 -0.397208 0.176704
H  4.810978 2.453614 1.248891
H  4.291372 0.805601 1.58979
H  3.185819 2.144935 1.854767
H  2.031668 3.297562 -0.154767
H  2.602407 2.938877 -1.784687
H  3.658129 3.758903 -0.647071
H  5.34255 -0.517124 0.082922
H  8.512319 -0.345678 -1.15305
H  7.449326 -1.374464 -0.189339
H  7.805035 -1.775906 -1.871655
H  6.866127 -0.270285 -3.739118
H  5.73184 1.020588 -3.357234
H  7.440385 1.197424 -2.980646
H  -0.408288 -1.108811 -2.515906
H  -1.023209 0.425243 -1.88969
H  -2.520016 0.296391 0.559852
H  -1.402634 -3.422808 -1.334867
H  -3.67626 -2.260575 2.791009
H  -4.86812 -2.669849 1.57768
H  -5.988382 -0.692475 0.301141
H  -3.861625 -0.207557 3.980731
H  -7.153964 1.439812 0.690116
H  -5.025905 1.930168 4.37171
H  -6.679913 2.762371 2.729896
elementType: O C H
totalener: -1079.75539535 hartree
nucrepener: 2002.10474646 hartree
electener: -3081.86014181 hartree
oneelecener: -5443.09475687 hartree
twoeener: 2361.23461506 hartree
cpcmener: -0.02567488 hartree
kineticenergy: 1074.84602434 hartree
xcener: -106.457744800841 hartree
chargesum: -0.0000000
charge: -0.273168 -0.477636 -0.277416 0.100374 0.036975 -0.090670 -0.269776 -0.273741 -0.268799 0.398137 -0.051711 -0.217204 -0.253005 0.087014 -0.101915 -0.288209 -0.027560 0.179137 -0.017566 -0.004291 -0.202588 -0.170500 -0.145159 -0.155100 -0.168291 0.088520 0.087602 0.096813 0.087446 0.097325 0.098031 0.090799 0.096355 0.116385 0.091787 0.087640 0.093361 0.093308 0.091276 0.096959 0.111694 0.108345 0.162487 0.175161 0.100073 0.109660 0.142008 0.139468 0.156616 0.155984 0.157564
qa: -0.2732 -0.4776 -0.2774 0.1004 0.0370 -0.0907 -0.2698 -0.2737 -0.2688 0.3981 -0.0517 -0.2172 -0.2530 0.0870 -0.1019 -0.2882 -0.0276 0.1791 -0.0176 -0.0043 -0.2026 -0.1705 -0.1452 -0.1551 -0.1683 0.0885 0.0876 0.0968 0.0874 0.0973 0.0980 0.0908 0.0964 0.1164 0.0918 0.0876 0.0934 0.0933 0.0913 0.0970 0.1117 0.1083 0.1625 0.1752 0.1001 0.1097 0.1420 0.1395 0.1566 0.1560 0.1576
va: 2.1214 2.0296 2.2788 3.7032 3.7629 3.8561 3.9111 3.9036 3.8732 4.1694 3.7695 3.9212 3.9406 3.8401 3.7631 3.9596 3.9462 3.6613 3.8055 3.6382 3.9357 3.9170 3.8875 3.8976 3.8961 1.0363 1.0348 1.0020 1.0063 1.0019 0.9997 1.0188 1.0002 1.0118 0.9960 1.0091 0.9963 0.9972 1.0103 0.9968 0.9998 0.9958 1.0034 0.9953 1.0054 1.0080 1.0020 1.0040 0.9907 0.9912 0.9903
dispcorr: -0.020964063 hartree
energy: -1079.776359417333
dipole: 31.80479 -31.73950 0.06528 10.17315 -10.33990 -0.16675 -1.53049 2.44011 0.90962
magnitude: 0.92708 au
magnitude: 2.35645 debye
