program: Orca
programVersion: 5.0.2
elementType: O O O C C C C C C C C C C C C C C C C C C C C C C H H H H H H H H H H H H H H H H H H H H H H H H H H
charge: 0
multiplicity: 1
keywords: wb97x-d3
keywords: def2-TZVPP
keywords: def2/J RIJCOSX
keywords: DEFGRID2
keywords: scfconv7
keywords: smallprint printgap noloewdin
keywords: NOSOSCF
formula: C22H26O3
InChI: InChI=1/C22H26O3/c1-15(2)10-19-20(22(19,3)4)21(23)25-14-17-12-18(24-13-17)11-16-8-6-5-7-9-16/h5-10,12-13,19-20H,11,14H2,1-4H3
51 atoms
O  1.490477 -0.982795 0.174456
O  3.174815 -0.645277 1.598256
O  -2.489765 -1.510201 -0.635126
C  4.832609 -0.3135 -1.064068
C  4.489733 1.028629 -0.516529
C  3.388737 0.000459 -0.700746
C  5.097379 -0.456352 -2.543415
C  5.648847 -1.261815 -0.221721
C  4.502253 2.257934 -1.352548
C  2.718159 -0.566416 0.481452
C  3.617571 3.254977 -1.268211
C  3.717913 4.465698 -2.144878
C  2.466273 3.264098 -0.310745
C  0.670257 -1.49202 1.222355
C  -0.712485 -1.600747 0.688072
C  -1.866295 -2.026995 1.420775
C  -1.154489 -1.302402 -0.55449
C  -2.914849 -1.950072 0.567374
C  -4.374599 -2.175485 0.735867
C  -5.124707 -0.866219 0.809902
C  -5.529118 -0.209939 -0.349126
C  -5.377262 -0.26902 2.04137
C  -6.169193 1.019914 -0.278008
C  -6.020076 0.958721 2.115706
C  -6.415055 1.60934 0.954641
H  4.778117 1.172533 0.522497
H  2.733539 0.158101 -1.549911
H  4.470569 0.199395 -3.147858
H  4.909138 -1.481466 -2.868262
H  6.139504 -0.225307 -2.773807
H  6.707989 -1.136636 -0.454785
H  5.388768 -2.300842 -0.433345
H  5.530935 -1.096825 0.846468
H  5.314252 2.34869 -2.069213
H  2.807813 4.594495 -2.736877
H  3.827607 5.375055 -1.548237
H  4.561737 4.410474 -2.832608
H  2.426642 2.385748 0.330194
H  2.515442 4.1430 0.337098
H  1.515869 3.332719 -0.846399
H  0.690293 -0.824489 2.087976
H  1.042769 -2.46567 1.553926
H  -1.905081 -2.338852 2.452803
H  -0.670209 -0.949193 -1.450336
H  -4.526008 -2.746958 1.652248
H  -4.757982 -2.784177 -0.087276
H  -5.346255 -0.663131 -1.316395
H  -5.0681 -0.769462 2.951736
H  -6.476797 1.518906 -1.18817
H  -6.211672 1.407707 3.082113
H  -6.914927 2.567788 1.010554
elementType: O C H
totalener: -1079.75281986 hartree
nucrepener: 2034.03094731 hartree
electener: -3113.78376717 hartree
oneelecener: -5506.94246320 hartree
twoeener: 2393.15869603 hartree
cpcmener: -0.02458596 hartree
kineticenergy: 1074.87026480 hartree
xcener: -106.463760104866 hartree
chargesum: -0.0000000
charge: -0.277557 -0.477036 -0.280455 0.147299 -0.013254 -0.097832 -0.283441 -0.280994 -0.290739 0.379470 -0.015302 -0.227798 -0.241342 0.106804 -0.016132 -0.357314 -0.073480 0.210683 -0.069902 0.065778 -0.202441 -0.205001 -0.153216 -0.148470 -0.176469 0.102473 0.098295 0.092272 0.097555 0.097916 0.094172 0.098534 0.092521 0.121022 0.093734 0.095531 0.089288 0.084627 0.101482 0.097542 0.105436 0.112615 0.159139 0.171114 0.106303 0.115890 0.139446 0.140008 0.156521 0.157268 0.157435
qa: -0.2776 -0.4770 -0.2805 0.1473 -0.0133 -0.0978 -0.2834 -0.2810 -0.2907 0.3795 -0.0153 -0.2278 -0.2413 0.1068 -0.0161 -0.3573 -0.0735 0.2107 -0.0699 0.0658 -0.2024 -0.2050 -0.1532 -0.1485 -0.1765 0.1025 0.0983 0.0923 0.0976 0.0979 0.0942 0.0985 0.0925 0.1210 0.0937 0.0955 0.0893 0.0846 0.1015 0.0975 0.1054 0.1126 0.1591 0.1711 0.1063 0.1159 0.1394 0.1400 0.1565 0.1573 0.1574
va: 2.1238 2.0301 2.2684 3.6956 3.8105 3.8191 3.9089 3.8946 3.8889 4.1400 3.7133 3.9305 3.9371 3.8547 3.7048 4.0201 3.9553 3.6358 3.8319 3.5740 3.9621 3.9493 3.8985 3.8911 3.9064 1.0258 1.0238 1.0024 1.0031 1.0002 1.0011 0.9989 1.0190 1.0039 0.9970 0.9963 1.0065 1.0112 0.9993 0.9992 0.9971 0.9896 1.0073 1.0007 1.0109 1.0071 1.0103 1.0042 0.9909 0.9905 0.9906
dispcorr: -0.022041469 hartree
energy: -1079.774861327017
dipole: 21.75179 -22.19627 -0.44448 12.62714 -12.53124 0.09589 -8.40074 7.83677 -0.56397
magnitude: 0.72445 au
magnitude: 1.84140 debye
