program: Gaussian 09
title: 000062084
version: EM64L-G09RevD.01
frameworkgroup: C1[X(C18H28N2O3S)]
method: RPBEPBE
basis: SDD
operation: Freq
keyword: #p
keyword: freq=noraman
keyword: PBEPBE/SDD
title: #p freq=noraman PBEPBE/SDD
converged: YES YES NO NO
title: Mulliken charges:
elementType: S O O O N N C C C C C C C C C C C C C C C C C C H H H H H H H H H H H H H H H H H H H H H H H H H H H H
charge: 1.155863 -0.537432 -0.469533 -0.462032 -0.625673 -0.058064 -0.390627 -0.385156 -0.373685 -0.385040 -0.377189 -0.382284 -0.372738 -0.508943 -0.353583 0.272448 -0.356657 0.329839 0.035382 -0.696745 -0.323016 -0.349150 -0.217322 -0.222667 0.196478 0.197057 0.192922 0.193955 0.190301 0.193222 0.193921 0.193425 0.217659 0.219276 0.192098 0.191705 0.262369 0.250440 0.189416 0.189686 0.187692 0.187497 0.194717 0.194922 0.209693 0.214989 0.209512 0.285422 0.254877 0.230885 0.231771 0.388097
chargesum: 0.00000
title: Mulliken charges with hydrogens summed into heavy atoms:
elementType: S O O O N N C C C C C C C C C C C C C C C C C C
charge: 1.155863 -0.149335 -0.469533 -0.462032 -0.625673 -0.058064 0.002908 0.001721 0.009838 0.002307 0.059746 0.001519 0.006364 0.003866 0.021606 0.272448 0.032982 0.329839 0.035382 -0.062552 -0.037593 -0.094273 0.013563 0.009104
polarizability: 3.31475172e+02 2.26080391e+01 2.72017894e+02 1.04732076e+00 9.21769313e-01 1.59257104e+02
1716.lowfreq: -1.7628 -0.0020 0.0019 0.0021 3.1842 5.5678 14.2351 17.4331 30.8825
frequency: 13.7070 17.3619 30.8780 34.8893 49.6347 51.2569 63.2812 68.3193 78.1750 97.0867 100.3813 112.2199 114.2146 131.6673 141.5680 154.6696 157.0532 158.6288 165.4678 183.6569 194.0173 223.9690 229.8166 241.0899 277.6443 283.4256 294.7298 302.6065 317.2641 331.0584 378.9184 403.9916 427.7958 429.8834 463.8881 487.4930 515.3412 537.0939 565.8032 593.1106 614.4602 620.3861 695.6523 722.1926 723.7727 728.2812 742.0053 755.4828 770.3759 770.5910 813.5138 844.3251 855.8146 865.1155 871.0269 878.0960 887.0349 921.8453 934.8987 952.1574 978.0511 980.8456 986.0093 987.4601 998.6741 1013.7976 1018.7302 1025.6709 1043.7275 1051.6053 1062.6294 1074.3431 1079.5859 1081.2262 1084.2017 1106.1293 1121.1446 1124.5420 1142.3778 1162.2693 1183.2858 1196.8325 1207.0144 1208.5306 1235.1489 1235.6611 1240.3856 1262.6703 1268.9618 1279.7503 1282.7960 1288.6761 1291.5392 1293.5699 1298.0422 1299.3655 1301.2518 1323.0176 1343.3829 1354.1487 1355.8513 1359.1588 1368.2687 1387.4233 1402.4903 1435.2230 1451.3952 1460.9994 1461.3229 1462.6577 1464.4757 1464.7601 1468.1215 1473.0453 1475.6569 1478.3501 1483.5846 1487.9742 1490.2499 1532.7142 1596.1647 1615.8560 2949.7232 2950.1967 2951.4229 2952.4744 2954.7052 2959.9062 2965.1673 2969.0710 2971.4375 2974.5999 2983.0205 2986.4582 2991.4818 2998.7212 2998.9692 3009.2912 3018.7964 3022.6069 3033.4159 3042.4480 3063.8834 3067.9494 3070.2617 3139.6315 3156.6945 3173.3021 3191.5091 3468.8869
redmass: 4.7071 4.9670 6.6185 4.0924 2.7204 2.1287 2.7195 4.4628 1.9124 2.7784 2.8798 2.7989 3.4221 1.7749 2.7887 3.3730 2.1110 2.2470 2.6718 4.3302 5.1535 1.1376 3.9260 2.6828 7.0723 3.7543 4.5065 4.7267 8.1514 10.6464 3.3436 3.7144 3.0641 9.5663 3.4798 3.1288 4.5891 15.5329 4.0172 6.5464 4.3699 7.2950 5.5260 1.0585 1.0669 1.0903 1.1333 1.9221 1.9115 1.2183 1.2385 9.6210 8.9293 1.2646 1.4310 6.3945 1.9063 1.2507 9.4173 1.3760 1.2323 4.7980 1.6055 4.5850 4.3035 2.0520 3.9140 1.0959 3.5037 1.1978 2.8152 2.9363 2.2177 2.2146 2.2894 1.8579 2.6822 1.4102 3.1874 1.2855 1.8454 2.5830 1.5191 1.3338 2.8202 1.4904 1.3423 1.2715 1.3285 1.0179 1.1433 1.0806 1.4484 1.0876 1.3762 1.1224 1.1055 1.4081 1.4824 1.6587 1.6309 1.6413 1.6842 1.2173 4.0236 2.9478 1.1655 1.0771 1.0774 2.6425 1.0869 1.0625 1.0816 1.0821 1.0427 1.0844 1.0908 1.0949 1.0978 6.8155 7.3257 7.7780 1.0586 1.0585 1.0591 1.0590 1.0595 1.0593 1.0587 1.0584 1.0368 1.0609 1.0961 1.0972 1.0990 1.1011 1.0601 1.1031 1.0987 1.1035 1.1049 1.1046 1.1036 1.1007 1.0992 1.0864 1.0917 1.0978 1.0963 1.0661
irintensity: 0.0215 0.0431 0.9636 0.8129 0.0562 0.0161 0.1339 0.5570 0.2956 0.3214 0.0709 1.0165 0.3555 0.2430 2.2482 19.5612 2.5269 0.8155 19.8806 1.1300 1.2207 0.0005 9.5499 50.5534 12.0532 1.9021 0.7249 5.1509 28.6284 4.7782 2.3410 1.4935 7.1641 99.2811 1.0187 1.3849 6.0301 175.8747 2.3651 3.3123 0.9230 16.3725 2.4033 17.9842 0.9904 6.1445 0.1491 51.5359 54.4290 0.1158 0.0674 53.8918 32.2512 1.2873 0.5634 27.4381 6.6639 0.0583 18.5640 4.4755 1.5343 2.3446 17.0627 77.8926 3.0041 9.7943 3.3650 0.0033 1.1090 101.3665 4.6227 10.4166 2.4764 0.1334 2.6578 6.5967 4.2818 0.0084 78.6687 7.3420 0.1437 23.0473 1.7296 22.4986 37.4339 6.2228 8.0266 0.0536 6.1757 0.1215 0.0987 0.0324 1.0126 0.2149 11.0930 0.2542 0.0670 6.6997 5.3880 1.7377 1.1547 1.2146 7.7147 11.2062 9.6126 65.2363 4.7641 0.0756 0.0095 5.0134 0.3268 0.0690 1.5785 0.4789 12.2710 2.9424 1.8794 1.7126 38.6229 56.3632 5.9059 4.3823 0.1294 0.6179 0.3567 2.7856 2.8693 0.5894 77.6029 197.2483 36.4591 3.6326 0.1265 0.3426 0.8954 1.0150 23.4174 0.6977 2.9313 3.0466 0.0893 211.7716 70.1175 103.0398 55.7812 4.1801 15.9976 13.2632 4.0528 59.0428
temp: 298.150 k
press: 1.00000 atm
elementType: 16 8 8 8 7 7 6 6 6 6 6 6 6 6 6 6 6 6 6 6 6 6 6 6 1 1 1 1 1 1 1 1 1 1 1 1 1 1 1 1 1 1 1 1 1 1 1 1 1 1 1 1
symmnumber: 1
zpe: 1131062.7 jmol-1
zpe.correction: 0.430799 hartree
zpe.thermalcorrener: 0.458299 hartree
zpe.thermalcorrenthalpy: 0.459243 hartree
zpe.thermalcorrgfe: 0.368767 hartree
zpe.sumelectzpe: -1433.908622 hartree
zpe.sumelectthermal: -1433.881121 hartree
zpe.sumelectthermalent: -1433.880177 hartree
zpe.sumelectthermalfe: -1433.970653 hartree
dipole: -0.4302 -0.1945 1.3405
dipole: 1.4212
quadrupole: -152.2097 -148.3910 -156.7491
quadrupole: 6.4341 5.2971 -7.7142
quadrupole: 0.2402 4.0589 -4.2992 6.4341 5.2971 -7.7142
hfenergy: -1434.3394207 hartree
pointgroup: C01 [X(C18H28N2O3S1)]
dipole: 0.1730006 0.0942615 0.5232736 debye
polarizability: 332.8440759|20.5835446|270.342177|-2.4527578|-5.8471222|159.5639174 unknown
InChI: InChI=1S/C18H28N2O3S/c1-2-3-4-5-6-7-8-9-10-15-18-19-16-13-11-12-14-17(16)20(18)24(21,22)23/h11-14,21H,2-10,15H2,1H3
charge 0 multiplicity 1
52 atoms
S  -4.07762 2.413831 -0.215273
O  -3.479969 2.743051 1.509356
O  -5.656277 2.691238 -0.319992
O  -3.060957 3.118217 -1.241093
N  -3.770548 0.632522 -0.138956
N  -2.649803 -1.326448 0.019753
C  2.6094 -0.337037 -0.068558
C  3.946692 0.437018 -0.076688
C  1.36946 0.583554 -0.116188
C  5.186196 -0.484922 -0.038933
C  0.040783 -0.202034 -0.085962
C  6.524856 0.287206 -0.037224
C  7.763941 -0.635798 -0.004102
C  -1.184382 0.735484 -0.155157
C  9.103506 0.134888 0.000554
C  -2.48475 -0.010384 -0.093152
C  10.341848 -0.789924 0.03237
C  -4.788739 -0.360666 -0.017082
C  -4.048428 -1.579978 0.071463
C  11.676069 -0.012604 0.036941
C  -6.195957 -0.32343 0.01002
C  -4.719821 -2.814042 0.184935
C  -6.850929 -1.570432 0.129067
C  -6.130399 -2.794258 0.214968
H  2.559457 -0.972112 0.840508
H  2.582636 -1.031847 -0.933734
H  3.976517 1.126407 0.793175
H  3.994311 1.07784 -0.982149
H  1.404427 1.287492 0.74196
H  1.413144 1.208082 -1.033212
H  5.159786 -1.169924 -0.912244
H  5.135237 -1.130621 0.862874
H  0.002729 -0.915411 -0.931006
H  -0.01679 -0.814374 0.833705
H  6.57502 0.935477 -0.937249
H  6.553021 0.969639 0.838144
H  -1.149046 1.340873 -1.082327
H  -1.150225 1.465459 0.679603
H  7.712729 -1.285625 0.894817
H  7.736675 -1.316891 -0.88056
H  9.156384 0.785285 -0.897846
H  9.133162 0.815167 0.877606
H  10.287793 -1.439396 0.930097
H  10.310952 -1.469282 -0.844009
H  11.769412 0.619301 -0.866608
H  12.544698 -0.69627 0.062319
H  11.743486 0.652758 0.918526
H  -6.756232 0.611355 -0.054431
H  -4.150834 -3.746472 0.245708
H  -7.945654 -1.591176 0.156528
H  -6.682767 -3.735386 0.305426
H  -3.4650 3.736901 1.640913
