program: Orca
programVersion: 5.0.2
elementType: O O O C C C C C C C C C C C C C C C C C C C C C C H H H H H H H H H H H H H H H H H H H H H H H H H H
charge: 0
multiplicity: 1
keywords: wb97x-d3
keywords: def2-TZVPP
keywords: def2/J RIJCOSX
keywords: DEFGRID2
keywords: scfconv7
keywords: smallprint printgap noloewdin
keywords: NOSOSCF
formula: C22H26O3
InChI: InChI=1/C22H26O3/c1-15(2)10-19-20(22(19,3)4)21(23)25-14-17-12-18(24-13-17)11-16-8-6-5-7-9-16/h5-10,12-13,19-20H,11,14H2,1-4H3
51 atoms
O  1.149071 -1.784343 -1.489905
O  0.411186 0.32605 -1.393391
O  -1.668906 -3.104953 1.538868
C  3.038848 0.639782 0.301168
C  3.233956 1.240628 -1.06074
C  2.709298 -0.16761 -0.942321
C  4.25208 0.194533 1.081701
C  1.930866 1.17031 1.177878
C  4.579979 1.459516 -1.637342
C  1.30622 -0.472791 -1.297376
C  5.155716 2.641043 -1.865103
C  6.521678 2.731338 -2.476877
C  4.51837 3.957977 -1.542294
C  -0.182857 -2.265083 -1.695117
C  -0.943809 -2.351798 -0.417482
C  -1.867881 -1.406785 0.132266
C  -0.871134 -3.356046 0.487751
C  -2.278616 -1.918153 1.316599
C  -3.210031 -1.43565 2.374657
C  -4.095132 -0.325875 1.877135
C  -5.265341 -0.61833 1.183702
C  -3.752722 1.005818 2.077609
C  -6.079111 0.396632 0.706927
C  -4.563626 2.025736 1.600123
C  -5.729882 1.723751 0.914542
H  2.476284 1.966326 -1.338964
H  3.409507 -0.966072 -1.164062
H  4.703078 1.042975 1.599512
H  5.022387 -0.246719 0.450611
H  3.973493 -0.546121 1.833146
H  1.536217 0.384333 1.824907
H  1.100219 1.578952 0.608491
H  2.319171 1.962596 1.820588
H  5.141144 0.567075 -1.900095
H  7.21207 3.270487 -1.823283
H  6.947468 1.748646 -2.676518
H  6.494145 3.281202 -3.421181
H  5.146675 4.526431 -0.851926
H  4.4125 4.571214 -2.440608
H  3.536305 3.860728 -1.08492
H  -0.049907 -3.254181 -2.132054
H  -0.709984 -1.643842 -2.420428
H  -2.175634 -0.472241 -0.306533
H  -0.313756 -4.279037 0.50898
H  -2.641186 -1.09573 3.246339
H  -3.822698 -2.271678 2.724451
H  -5.541077 -1.652835 1.015941
H  -2.841536 1.248671 2.611347
H  -6.988665 0.151896 0.173911
H  -4.28318 3.057721 1.765705
H  -6.36525 2.517751 0.54507
totalener: -1079.73210409 hartree
nucrepener: 2081.62369718 hartree
electener: -3161.35580127 hartree
oneelecener: -5601.73998531 hartree
twoeener: 2440.38418404 hartree
kineticenergy: 1074.90854288 hartree
xcener: -106.465603124576 hartree
chargesum: -0.0000000
charge: -0.261169 -0.394907 -0.252844 0.123165 0.012417 -0.127798 -0.233141 -0.274482 -0.194688 0.365213 -0.032657 -0.210256 -0.236242 0.043421 -0.074772 -0.217857 -0.035243 0.168071 -0.056748 0.016845 -0.157479 -0.149479 -0.118530 -0.119209 -0.129421 0.094439 0.070509 0.087660 0.073028 0.090750 0.088331 0.101062 0.083304 0.079272 0.082718 0.077352 0.085914 0.083611 0.088279 0.081683 0.103680 0.111334 0.148595 0.136119 0.089064 0.098396 0.109245 0.109768 0.124377 0.123873 0.125430
qa: -0.2612 -0.3949 -0.2528 0.1232 0.0124 -0.1278 -0.2331 -0.2745 -0.1947 0.3652 -0.0327 -0.2103 -0.2362 0.0434 -0.0748 -0.2179 -0.0352 0.1681 -0.0567 0.0168 -0.1575 -0.1495 -0.1185 -0.1192 -0.1294 0.0944 0.0705 0.0877 0.0730 0.0907 0.0883 0.1011 0.0833 0.0793 0.0827 0.0774 0.0859 0.0836 0.0883 0.0817 0.1037 0.1113 0.1486 0.1361 0.0891 0.0984 0.1092 0.1098 0.1244 0.1239 0.1254
va: 2.1337 2.1105 2.3022 3.7242 3.7733 3.9290 3.9022 3.9147 3.8937 4.2219 3.7715 3.9389 3.9485 3.9068 3.6928 3.9570 3.9913 3.6728 3.8461 3.6845 3.9957 3.9738 3.9582 3.9611 3.9575 1.0298 1.0406 1.0060 1.0099 1.0045 1.0016 1.0219 1.0019 1.0175 0.9987 1.0115 0.9976 0.9997 0.9996 1.0128 0.9955 1.0060 1.0159 1.0072 1.0051 1.0097 1.0105 1.0115 1.0001 1.0005 0.9997
dispcorr: -0.022760103 hartree
energy: -1079.754864190862
dipole: 25.47506 -25.12385 0.35121 17.69090 -17.78404 -0.09313 -1.17885 1.35233 0.17348
magnitude: 0.40264 au
magnitude: 1.02343 debye
