program: Orca
programVersion: 5.0.2
elementType: O O O C C C C C C C C C C C C C C C C C C C C C C H H H H H H H H H H H H H H H H H H H H H H H H H H
charge: 0
multiplicity: 1
keywords: wb97x-d3
keywords: def2-TZVPP
keywords: def2/J RIJCOSX
keywords: DEFGRID2
keywords: scfconv7
keywords: smallprint printgap noloewdin
keywords: NOSOSCF
formula: C22H26O3
InChI: InChI=1/C22H26O3/c1-15(2)10-19-20(22(19,3)4)21(23)25-14-17-12-18(24-13-17)11-16-8-6-5-7-9-16/h5-10,12-13,19-20H,11,14H2,1-4H3
51 atoms
O  1.698218 -2.369673 -0.958058
O  2.150754 -1.624173 1.101894
O  -2.021568 -2.312749 1.343153
C  3.880164 0.526761 -0.346936
C  2.504048 1.083029 -0.140242
C  2.67951 -0.274931 -0.803575
C  4.751758 1.093636 -1.443726
C  4.675507 0.113158 0.867997
C  1.961614 2.210022 -0.919932
C  2.170949 -1.466968 -0.091178
C  1.259227 3.245177 -0.451286
C  0.780657 4.32608 -1.375993
C  0.889167 3.449263 0.986627
C  0.971359 -3.472851 -0.406435
C  -0.372502 -3.030501 0.047353
C  -1.461798 -2.601521 -0.775294
C  -0.779944 -2.823884 1.320667
C  -2.429959 -2.167294 0.064623
C  -3.724263 -1.478247 -0.165819
C  -3.630409 0.004717 0.122303
C  -2.674959 0.783226 -0.524476
C  -4.483207 0.614195 1.03273
C  -2.580446 2.141011 -0.271908
C  -4.389382 1.975236 1.291721
C  -3.4378 2.742773 0.639573
H  2.15547 1.008792 0.883651
H  2.524673 -0.301058 -1.876525
H  5.231386 2.015672 -1.110831
H  4.201398 1.321123 -2.355626
H  5.538458 0.384706 -1.706972
H  4.052581 -0.249411 1.680672
H  5.247557 0.967345 1.235395
H  5.387541 -0.674992 0.614992
H  2.157335 2.187157 -1.988037
H  1.020052 4.115017 -2.417567
H  -0.301891 4.462546 -1.30284
H  1.228351 5.289319 -1.117923
H  1.307653 2.702172 1.656751
H  1.227448 4.428828 1.333558
H  -0.196492 3.428995 1.113265
H  1.529577 -3.940418 0.406241
H  0.898211 -4.189768 -1.223793
H  -1.503259 -2.599628 -1.853059
H  -0.293423 -2.973672 2.270275
H  -4.514402 -1.925851 0.442472
H  -4.01074 -1.636833 -1.20827
H  -1.986269 0.320419 -1.221158
H  -5.226317 0.019689 1.550709
H  -1.829625 2.72699 -0.786113
H  -5.05867 2.433267 2.008243
H  -3.361948 3.803461 0.840965
totalener: -1079.73118626 hartree
nucrepener: 2178.92324298 hartree
electener: -3258.65442924 hartree
oneelecener: -5796.22087708 hartree
twoeener: 2537.56644784 hartree
kineticenergy: 1074.91482062 hartree
xcener: -106.468735434965 hartree
chargesum: 0.0000000
charge: -0.269674 -0.402271 -0.246875 0.094988 0.044921 -0.098139 -0.250464 -0.256210 -0.177541 0.365540 -0.096799 -0.196475 -0.205987 0.068893 -0.073990 -0.307744 0.016643 0.223019 -0.114347 0.073088 -0.176780 -0.165061 -0.120601 -0.095715 -0.155260 0.092969 0.068511 0.093589 0.070890 0.090275 0.102049 0.083146 0.081655 0.070138 0.078882 0.074042 0.093391 0.084495 0.085863 0.070681 0.105097 0.104265 0.130093 0.141523 0.090736 0.105634 0.114633 0.105385 0.140173 0.123243 0.121481
qa: -0.2697 -0.4023 -0.2469 0.0950 0.0449 -0.0981 -0.2505 -0.2562 -0.1775 0.3655 -0.0968 -0.1965 -0.2060 0.0689 -0.0740 -0.3077 0.0166 0.2230 -0.1143 0.0731 -0.1768 -0.1651 -0.1206 -0.0957 -0.1553 0.0930 0.0685 0.0936 0.0709 0.0903 0.1020 0.0831 0.0817 0.0701 0.0789 0.0740 0.0934 0.0845 0.0859 0.0707 0.1051 0.1043 0.1301 0.1415 0.0907 0.1056 0.1146 0.1054 0.1402 0.1232 0.1215
va: 2.1267 2.0973 2.3148 3.7263 3.7849 3.8915 3.9180 3.9066 3.8817 4.1944 3.8527 3.9260 3.9299 3.8855 3.6845 4.0226 3.9861 3.6177 3.8913 3.6772 4.0440 4.0126 3.9264 3.9512 3.9607 1.0341 1.0388 1.0034 1.0103 1.0045 1.0248 1.0002 1.0033 1.0223 1.0125 0.9971 0.9979 1.0177 1.0005 1.0111 1.0108 0.9916 1.0163 1.0134 1.0158 1.0029 1.0166 1.0116 0.9833 1.0000 1.0037
dispcorr: -0.024934025 hartree
energy: -1079.756120286455
dipole: 14.24837 -14.34938 -0.10100 21.13950 -20.89703 0.24247 -4.10628 3.51649 -0.58979
magnitude: 0.64563 au
magnitude: 1.64107 debye
