program: Orca
programVersion: 5.0.2
elementType: O O O C C C C C C C C C C C C C C C C C C C C C C H H H H H H H H H H H H H H H H H H H H H H H H H H
charge: 0
multiplicity: 1
keywords: wb97x-d3
keywords: def2-TZVPP
keywords: def2/J RIJCOSX
keywords: DEFGRID2
keywords: scfconv7
keywords: smallprint printgap noloewdin
keywords: NOSOSCF
formula: C22H26O3
InChI: InChI=1/C22H26O3/c1-15(2)10-19-20(22(19,3)4)21(23)25-14-17-12-18(24-13-17)11-16-8-6-5-7-9-16/h5-10,12-13,19-20H,11,14H2,1-4H3
51 atoms
O  1.744291 -2.055657 -0.057106
O  1.15857 -1.244471 -2.060135
O  -2.586335 -2.353931 -0.350719
C  1.085456 1.360983 -0.258169
C  2.168224 1.435601 -1.284692
C  2.078067 0.214277 -0.405085
C  1.213522 2.170798 1.009396
C  -0.346539 1.19826 -0.709323
C  3.315585 2.370903 -1.155944
C  1.618336 -1.073732 -0.961445
C  4.553642 2.132458 -1.590917
C  5.644516 3.148966 -1.439209
C  4.956755 0.856138 -2.263997
C  0.965202 -3.23206 -0.289546
C  -0.466978 -2.922879 -0.034566
C  -1.044555 -2.550975 1.220829
C  -1.455228 -2.774101 -0.945734
C  -2.328295 -2.209157 0.967225
C  -3.398067 -1.61484 1.812832
C  -3.416851 -0.109803 1.676913
C  -2.696402 0.687159 2.559653
C  -4.099346 0.500601 0.630384
C  -2.659774 2.064695 2.404433
C  -4.06354 1.87762 0.470971
C  -3.342153 2.664317 1.356477
H  1.828148 1.259911 -2.302663
H  2.799826 0.131573 0.400125
H  0.624579 1.716504 1.807968
H  0.833227 3.183565 0.858625
H  2.244068 2.250225 1.356082
H  -0.943483 0.686418 0.048579
H  -0.436319 0.644438 -1.640832
H  -0.796071 2.181065 -0.86342
H  3.110964 3.333588 -0.695801
H  6.048218 3.441868 -2.411717
H  5.297392 4.050461 -0.935501
H  6.481606 2.743511 -0.865088
H  4.136912 0.147657 -2.3597
H  5.342012 1.056608 -3.266997
H  5.765376 0.365869 -1.715727
H  1.348292 -3.966233 0.418741
H  1.118402 -3.618959 -1.298215
H  -0.551559 -2.51946 2.179397
H  -1.484948 -2.907699 -2.014468
H  -3.21441 -1.894936 2.851313
H  -4.370843 -2.03359 1.543246
H  -2.155714 0.225979 3.378117
H  -4.659984 -0.106461 -0.069929
H  -2.096721 2.670187 3.10286
H  -4.599777 2.33727 -0.348939
H  -3.314916 3.738848 1.232589
totalener: -1079.72940956 hartree
nucrepener: 2207.30664412 hartree
electener: -3287.03605368 hartree
oneelecener: -5853.15950279 hartree
twoeener: 2566.12344911 hartree
kineticenergy: 1074.91529698 hartree
xcener: -106.467791121103 hartree
chargesum: 0.0000000
charge: -0.266314 -0.381075 -0.251256 0.189551 -0.025380 -0.108361 -0.294048 -0.242219 -0.243458 0.321404 -0.005059 -0.212428 -0.224909 0.067236 -0.062498 -0.282006 0.003116 0.218158 -0.137796 0.074397 -0.150365 -0.141944 -0.143855 -0.122196 -0.131858 0.106297 0.081123 0.084947 0.089665 0.088869 0.052403 0.100447 0.087265 0.091970 0.086258 0.077716 0.083586 0.082977 0.089025 0.083219 0.103288 0.105240 0.121474 0.142041 0.098848 0.108556 0.102888 0.110659 0.125886 0.123913 0.124605
qa: -0.2663 -0.3811 -0.2513 0.1896 -0.0254 -0.1084 -0.2940 -0.2422 -0.2435 0.3214 -0.0051 -0.2124 -0.2249 0.0672 -0.0625 -0.2820 0.0031 0.2182 -0.1378 0.0744 -0.1504 -0.1419 -0.1439 -0.1222 -0.1319 0.1063 0.0811 0.0849 0.0897 0.0889 0.0524 0.1004 0.0873 0.0920 0.0863 0.0777 0.0836 0.0830 0.0890 0.0832 0.1033 0.1052 0.1215 0.1420 0.0988 0.1086 0.1029 0.1107 0.1259 0.1239 0.1246
va: 2.1091 2.1178 2.3002 3.6845 3.8397 3.8249 3.9106 3.9000 3.9023 4.2491 3.7307 3.9416 3.9406 3.8990 3.7082 4.0248 3.9693 3.6080 3.8756 3.6167 3.9385 3.9854 3.9329 3.9496 3.9241 1.0254 1.0330 1.0099 1.0008 1.0074 1.0037 1.0258 1.0056 1.0093 0.9983 1.0098 0.9992 1.0199 1.0015 1.0011 0.9913 1.0107 1.0207 1.0113 1.0127 1.0127 1.0126 1.0170 0.9999 1.0004 1.0003
dispcorr: -0.028024300 hartree
energy: -1079.757433862226
dipole: 17.01302 -16.98889 0.02414 17.61994 -17.47251 0.14743 -0.98268 1.71831 0.73563
magnitude: 0.75065 au
magnitude: 1.90799 debye
