program: Orca
programVersion: 5.0.2
elementType: O O O C C C C C C C C C C C C C C C C C C C C C C H H H H H H H H H H H H H H H H H H H H H H H H H H
charge: 0
multiplicity: 1
keywords: wb97x-d3
keywords: def2-TZVPP
keywords: def2/J RIJCOSX
keywords: DEFGRID2
keywords: scfconv7
keywords: smallprint printgap noloewdin
keywords: NOSOSCF
formula: C22H26O3
InChI: InChI=1/C22H26O3/c1-15(2)10-19-20(22(19,3)4)21(23)25-14-17-12-18(24-13-17)11-16-8-6-5-7-9-16/h5-10,12-13,19-20H,11,14H2,1-4H3
51 atoms
O  1.714437 -2.261915 -0.247637
O  0.90611 -1.178261 -2.033862
O  -2.06073 -3.309021 1.634185
C  1.435753 1.263752 -0.138697
C  2.464138 1.232114 -1.232006
C  2.221608 -0.009345 -0.41607
C  1.765556 1.972272 1.152746
C  -0.022028 1.371425 -0.51486
C  3.759058 1.942002 -1.114313
C  1.547009 -1.179745 -1.014514
C  4.09223 3.059817 -1.761691
C  5.439442 3.692187 -1.5822
C  3.177779 3.775839 -2.708432
C  0.891883 -3.401015 -0.520998
C  -0.438951 -3.227591 0.121973
C  -1.503384 -2.364819 -0.287945
C  -0.84381 -3.769285 1.295132
C  -2.454796 -2.447112 0.670562
C  -3.738201 -1.716469 0.871243
C  -3.504958 -0.245808 1.127852
C  -3.925833 0.713854 0.217077
C  -2.832238 0.169835 2.274653
C  -3.683577 2.062736 0.442688
C  -2.590917 1.514004 2.504065
C  -3.016202 2.46652 1.586948
H  2.044039 1.183551 -2.231903
H  2.964481 -0.255316 0.335574
H  2.806871 1.849391 1.448542
H  1.139476 1.595313 1.963353
H  1.578208 3.04334 1.056875
H  -0.241689 0.934459 -1.485575
H  -0.310576 2.423651 -0.551746
H  -0.661388 0.887848 0.226523
H  4.492776 1.507637 -0.440932
H  5.976124 3.752119 -2.532531
H  5.347534 4.716532 -1.212203
H  6.062933 3.137429 -0.88202
H  3.61243 3.823666 -3.709985
H  2.196967 3.313112 -2.790399
H  3.027246 4.809418 -2.38736
H  1.421806 -4.248445 -0.087146
H  0.804509 -3.566203 -1.595323
H  -1.534666 -1.74613 -1.16903
H  -0.38305 -4.470885 1.971978
H  -4.280815 -2.163696 1.707537
H  -4.374479 -1.839269 -0.007842
H  -4.44706 0.406018 -0.681645
H  -2.489692 -0.56718 2.991526
H  -4.016533 2.796576 -0.27953
H  -2.067778 1.820793 3.400545
H  -2.825254 3.516652 1.764253
totalener: -1079.73037957 hartree
nucrepener: 2178.47580812 hartree
electener: -3258.20618768 hartree
oneelecener: -5795.39250655 hartree
twoeener: 2537.18631887 hartree
kineticenergy: 1074.91222176 hartree
xcener: -106.467683227367 hartree
chargesum: -0.0000000
charge: -0.261187 -0.395285 -0.253412 0.195962 -0.006758 -0.136082 -0.240990 -0.293086 -0.194579 0.354882 -0.028137 -0.212527 -0.237079 0.052348 -0.051756 -0.298167 -0.034646 0.247945 -0.104480 0.007299 -0.127024 -0.128809 -0.126541 -0.142740 -0.130135 0.097394 0.070849 0.075174 0.089770 0.085644 0.101563 0.084561 0.067263 0.081442 0.085755 0.082905 0.077372 0.089227 0.082063 0.082670 0.093413 0.115800 0.152747 0.135267 0.108766 0.095448 0.106281 0.113348 0.123018 0.123918 0.123326
qa: -0.2612 -0.3953 -0.2534 0.1960 -0.0068 -0.1361 -0.2410 -0.2931 -0.1946 0.3549 -0.0281 -0.2125 -0.2371 0.0523 -0.0518 -0.2982 -0.0346 0.2479 -0.1045 0.0073 -0.1270 -0.1288 -0.1265 -0.1427 -0.1301 0.0974 0.0708 0.0752 0.0898 0.0856 0.1016 0.0846 0.0673 0.0814 0.0858 0.0829 0.0774 0.0892 0.0821 0.0827 0.0934 0.1158 0.1527 0.1353 0.1088 0.0954 0.1063 0.1133 0.1230 0.1239 0.1233
va: 2.1282 2.1073 2.3056 3.6430 3.7924 3.9573 3.9044 3.9235 3.8929 4.2411 3.7547 3.9401 3.9480 3.9020 3.7442 3.9781 3.9779 3.5729 3.8373 3.7405 3.9470 3.9259 3.9512 3.9286 3.9147 1.0269 1.0408 1.0106 1.0058 1.0060 1.0228 1.0063 1.0032 1.0167 0.9974 0.9986 1.0114 0.9998 1.0124 1.0000 0.9965 1.0082 1.0188 1.0071 1.0134 1.0075 1.0110 1.0168 1.0013 1.0021 1.0011
dispcorr: -0.026611177 hartree
energy: -1079.756990741813
dipole: 14.59826 -14.58402 0.01424 24.80612 -24.47811 0.32800 -4.58723 5.07656 0.48933
magnitude: 0.58927 au
magnitude: 1.49780 debye
