program: Gaussian 09
title: 000062071
version: EM64L-G09RevD.01
frameworkgroup: C1[X(C21H36O)]
method: RPBEPBE
basis: SDD
operation: Freq
keyword: #pfreq=noraman
keyword: PBEPBE/SDD
title: #p freq=noraman PBEPBE/SDD
converged: YES YES NO NO
title: Mulliken charges:
elementType: O C C C C C C C C C C C C C C C C C C C C C H H H H H H H H H H H H H H H H H H H H H H H H H H H H H H H H H H H H
charge: -0.295070 0.014804 -0.433642 -0.420506 -0.409951 -0.438623 0.378475 -0.409063 -0.755687 -0.579932 -0.773410 -0.734941 0.499342 -0.448388 -0.400133 0.540314 -0.529684 -0.233796 -0.410541 -0.471325 -0.692898 -0.690271 0.203831 0.191566 0.194532 0.200557 0.215365 0.186934 0.229003 0.209903 0.209674 0.202389 0.213764 0.204160 0.220168 0.211902 0.211380 0.203287 0.232907 0.224240 0.221777 0.228146 0.226350 0.198018 0.230713 0.230250 0.208876 0.201185 0.225247 0.206829 0.226224 0.228930 0.208736 0.225809 0.213044 0.211147 0.210931 0.227151
chargesum: 0.00000
title: Mulliken charges with hydrogens summed into heavy atoms:
elementType: O C C C C C C C C C C C C C C C C C C C C C
charge: -0.295070 0.218635 -0.047544 -0.004584 0.005985 -0.019047 0.378475 0.007090 -0.119457 -0.165265 -0.094485 -0.082428 0.499342 -0.217674 -0.169882 0.540314 0.105624 -0.026967 -0.184316 -0.242395 -0.045309 -0.041041
polarizability: 2.51631844e+02 -3.24337539e+01 2.28673301e+02 -3.62836349e+00 -5.90987741e+00 2.00945019e+02
1716.lowfreq: -18.3085 -11.2443 -0.0008 -0.0007 -0.0006 5.8535 10.7819 23.2698 26.3775
frequency: -10.5822 22.4090 25.7144 34.5315 43.9435 49.5049 52.8266 76.1996 80.1125 103.9204 123.3704 130.1594 162.3855 172.0825 190.4987 203.4322 207.3146 213.5463 217.5166 228.2780 244.4435 247.3948 253.8889 274.6822 283.1340 293.9223 331.0862 338.1767 350.8052 356.3537 397.0321 406.8720 418.3711 428.6485 432.2925 445.3238 476.4565 499.1190 524.4515 527.1462 574.3953 637.8939 671.6558 708.5214 737.4160 746.2310 760.3897 794.4653 802.6227 814.9684 835.5776 848.4659 854.8178 869.7491 889.3420 914.3216 915.2543 922.4867 943.8945 954.2586 956.5279 967.1779 971.1397 972.2410 980.9316 995.2551 1011.3170 1012.8701 1026.3818 1048.6661 1055.7257 1076.8323 1080.4343 1090.0601 1108.9403 1112.9074 1116.0201 1122.9830 1132.2186 1152.1035 1153.7671 1158.4857 1188.8699 1190.8280 1202.6209 1218.4574 1221.1455 1230.4689 1241.3853 1259.7203 1274.4588 1281.3856 1292.7378 1300.2098 1306.2486 1308.7736 1318.5710 1322.9972 1333.0032 1338.5305 1351.2450 1357.0676 1360.9364 1371.4398 1374.6104 1382.4267 1383.3130 1386.8130 1393.1747 1411.8538 1435.0526 1454.7767 1456.5194 1458.2903 1460.6400 1461.7028 1464.1625 1466.3845 1469.3108 1471.8124 1473.5926 1473.9542 1477.2307 1478.5459 1481.3969 1482.8891 1483.7777 1487.3146 1491.3238 1506.2960 1579.9109 1621.0553 2938.2094 2944.2617 2949.0802 2956.6293 2965.8512 2966.8374 2971.6785 2973.0588 2975.0483 2975.6760 2977.5985 2979.2008 2981.7867 2992.2683 3005.1960 3011.5733 3013.7275 3020.1964 3030.3668 3039.8713 3046.4404 3057.7885 3066.0062 3070.8444 3072.9136 3073.2712 3075.5215 3079.7353 3080.1397 3087.1942 3093.9833 3094.7848 3103.5326 3108.6246 3126.7586 3134.9479
redmass: 3.2492 2.7387 3.4029 4.0856 4.2979 2.7571 2.1177 3.1083 2.8307 2.7458 2.2818 2.5160 2.3731 2.2710 2.1321 1.2707 1.2683 1.4996 1.4377 1.6611 1.6698 1.2810 1.4471 1.6165 2.3862 2.6057 2.5694 2.8488 2.2826 2.4000 2.9070 2.8269 2.3458 2.5562 2.9103 2.6222 3.0708 2.8181 2.8454 2.8237 2.2907 6.7364 2.5899 2.5367 1.9551 1.6925 2.1708 2.8344 2.6687 1.6350 1.6653 1.2536 1.7297 1.7237 2.5411 1.6363 1.2228 1.6398 1.5983 1.4466 1.4474 1.5850 1.3877 1.6218 1.8206 2.2882 3.3846 3.1596 1.9360 1.5729 1.8179 2.7003 1.6538 1.8145 1.3128 1.6882 2.4122 1.7371 1.5844 2.0139 1.7352 1.4014 1.6982 1.1286 1.6351 2.0446 1.6572 1.4936 2.2911 1.7233 1.3493 1.2777 1.6169 1.3964 1.2910 1.3266 1.4345 1.2585 1.4185 1.3971 1.5006 1.4346 1.4629 1.2536 1.1976 3.0363 1.3381 1.2253 1.2483 2.3988 1.1204 1.0759 1.0573 1.0761 1.0817 1.0529 1.0522 1.0526 1.0530 1.1023 1.0623 1.0710 1.0491 1.0715 1.0649 1.0932 1.0518 1.0765 1.0718 2.3547 6.3827 6.4340 1.0333 1.0735 1.0609 1.0685 1.0594 1.0390 1.0576 1.0353 1.0601 1.0385 1.0821 1.0369 1.0611 1.0358 1.0974 1.1012 1.0946 1.0992 1.1005 1.1022 1.1026 1.0986 1.1000 1.0984 1.0993 1.0993 1.0996 1.0996 1.0995 1.0977 1.0998 1.0992 1.0866 1.0866 1.0960 1.0966
irintensity: 0.6984 0.9802 0.0277 0.0659 0.0236 0.1904 1.4755 0.7104 0.4521 0.3981 0.0479 0.0237 0.1718 0.1538 0.1052 0.0630 0.0350 0.9090 3.7281 0.0085 0.1074 0.1180 0.4819 1.3437 0.8339 0.1600 3.2520 1.0991 0.2625 0.2818 0.1247 0.0200 1.6318 3.2248 3.5529 0.8717 0.0804 5.2388 1.1913 7.0900 30.3328 0.0550 2.6691 3.0478 4.7983 9.6867 1.3374 0.5247 9.7786 4.7658 38.5230 0.6462 5.1654 12.9509 1.5115 1.3679 5.2607 1.9446 0.5414 0.0448 0.1340 4.2865 0.1437 0.9968 1.2100 1.3714 27.9553 22.4472 22.3039 16.4884 7.5315 1.6222 0.4829 3.8036 0.7319 4.9973 1.1306 7.8574 11.2209 27.6806 2.8927 4.2431 3.9727 1.3279 6.3287 0.8989 3.1026 11.5400 23.3347 10.8903 8.7318 1.2847 3.6302 6.8003 6.9089 0.7021 5.9833 1.9457 2.6975 1.6174 5.7532 2.7584 5.3755 43.4029 5.1480 6.5532 14.8676 18.7635 10.1819 5.6515 0.7798 1.7108 0.8807 1.3186 8.7191 2.8016 3.0956 6.5464 4.9026 10.6667 4.8143 4.9058 10.5456 10.5200 2.3793 10.6910 31.5315 4.8446 2.8388 36.1708 0.0596 0.1737 59.2265 3.7678 28.5185 21.7150 28.0013 62.7945 14.2206 37.3417 51.2820 24.5495 16.2141 15.6133 33.3015 19.6510 36.1318 69.1649 3.3136 14.7753 34.3459 100.6212 92.1325 63.6246 0.2973 43.6020 107.4873 40.5903 16.1422 28.0343 29.4143 41.8245 35.5931 40.3757 12.5736 18.6915 41.1366 4.1384
temp: 298.150 k
press: 1.00000 atm
elementType: 8 6 6 6 6 6 6 6 6 6 6 6 6 6 6 6 6 6 6 6 6 6 1 1 1 1 1 1 1 1 1 1 1 1 1 1 1 1 1 1 1 1 1 1 1 1 1 1 1 1 1 1 1 1 1 1 1 1
symmnumber: 1
zpe: 1361630.8 jmol-1
zpe.correction: 0.518618 hartree
zpe.thermalcorrener: 0.544356 hartree
zpe.thermalcorrenthalpy: 0.545300 hartree
zpe.thermalcorrgfe: 0.462241 hartree
zpe.sumelectzpe: -895.289299 hartree
zpe.sumelectthermal: -895.263561 hartree
zpe.sumelectthermalent: -895.262617 hartree
zpe.sumelectthermalfe: -895.345676 hartree
dipole: -0.5599 -1.5501 -0.6037
dipole: 1.7552
quadrupole: -136.8419 -147.8296 -133.9178
quadrupole: -7.2430 -3.1642 -4.3553
quadrupole: 2.6878 -8.2998 5.6120 -7.2430 -3.1642 -4.3553
hfenergy: -895.8079169 hartree
pointgroup: C01 [X(C21H36O1)]
dipole: 0.3952498 0.5271331 -0.2067476 debye
polarizability: 231.6525275|-33.819879|247.8841256|6.1879283|3.6824752|201.713511 unknown
InChI: InChI=1S/C21H36O/c1-17(2)20-14-12-19(13-15-20)11-7-9-18(3)10-8-16-21(4,5)22-6/h12-15,17-18H,7-11,16H2,1-6H3
charge 0 multiplicity 1
58 atoms
O  -1.964384 -3.060369 1.136922
C  -2.898867 2.18851 0.036008
C  -3.659001 1.247012 -0.941747
C  -2.996367 -0.125663 -1.228886
C  -1.452171 2.478481 -0.444992
C  -2.700865 -0.945115 0.050025
C  -2.203073 -2.397822 -0.189534
C  -0.597472 3.285772 0.557718
C  -3.712481 3.488775 0.242476
C  0.898858 3.399577 0.141574
C  -0.921889 -2.443784 -1.05428
C  -3.303838 -3.291777 -0.791766
C  1.648572 2.073082 0.174966
C  2.004492 1.387694 -1.015152
C  2.005964 1.474381 1.410622
C  3.059363 -0.438577 0.262097
C  -0.874537 -2.534476 1.955757
C  3.844751 -1.752792 0.316295
C  2.69548 0.156526 -0.97382
C  2.696756 0.242697 1.452099
C  3.087292 -2.916573 -0.37562
C  5.26426 -1.584612 -0.290918
H  -2.828026 1.67679 1.02019
H  -4.674542 1.070685 -0.529197
H  -3.803069 1.78195 -1.904739
H  -3.675667 -0.698391 -1.890853
H  -2.059713 0.022911 -1.800253
H  -1.494952 3.021638 -1.414105
H  -0.934756 1.520694 -0.646314
H  -3.615044 -0.997832 0.675494
H  -1.937099 -0.405097 0.643529
H  -0.658009 2.807475 1.557366
H  -1.00676 4.308641 0.670729
H  -3.769104 4.069216 -0.699559
H  -3.264551 4.139657 1.014627
H  -4.74787 3.260147 0.558492
H  1.39644 4.119356 0.821644
H  0.95297 3.834309 -0.875916
H  -0.149474 -1.73677 -0.699926
H  -0.499335 -3.465038 -1.042065
H  -1.154759 -2.184892 -2.102566
H  -4.185295 -3.303451 -0.127204
H  -2.933906 -4.327385 -0.887787
H  -3.612489 -2.934781 -1.789784
H  1.743401 1.830115 -1.984886
H  1.750473 1.983624 2.348982
H  0.108615 -2.597066 1.445207
H  -1.040432 -1.484216 2.272417
H  -0.85209 -3.175902 2.852384
H  3.96863 -2.02204 1.385125
H  2.959867 -0.340118 -1.915658
H  2.970447 -0.192825 2.421909
H  2.931662 -2.708279 -1.450764
H  2.094922 -3.078047 0.08308
H  3.662979 -3.857455 -0.29495
H  5.206293 -1.325223 -1.364532
H  5.84122 -2.523823 -0.199626
H  5.823981 -0.780726 0.220066
