program: Orca
programVersion: 5.0.2
elementType: O O O C C C C C C C C C C C C C C C C C C C C C C H H H H H H H H H H H H H H H H H H H H H H H H H H
charge: 0
multiplicity: 1
keywords: wb97x-d3
keywords: def2-TZVPP
keywords: def2/J RIJCOSX
keywords: DEFGRID2
keywords: scfconv7
keywords: smallprint printgap noloewdin
keywords: NOSOSCF
formula: C22H26O3
InChI: InChI=1/C22H26O3/c1-15(2)10-19-20(22(19,3)4)21(23)25-14-17-12-18(24-13-17)11-16-8-6-5-7-9-16/h5-10,12-13,19-20H,11,14H2,1-4H3
51 atoms
O  1.566592 -1.708852 0.387563
O  1.429959 -1.356123 -1.817122
O  -2.645264 -2.301738 -0.705037
C  1.723192 1.626937 -0.873291
C  2.994311 1.144887 -1.491388
C  2.354687 0.328168 -0.393893
C  1.782996 2.771335 0.109902
C  0.450336 1.608461 -1.685188
C  4.280342 1.85406 -1.26581
C  1.741198 -0.976986 -0.717261
C  5.451647 1.292833 -0.9624
C  6.684977 2.12434 -0.773566
C  5.651014 -0.182119 -0.794152
C  0.83214 -2.927342 0.242361
C  -0.627099 -2.660168 0.137561
C  -1.520888 -2.30775 1.196977
C  -1.373649 -2.631214 -0.991076
C  -2.73132 -2.100838 0.6293
C  -4.039831 -1.64932 1.175901
C  -4.146873 -0.144279 1.274775
C  -4.005825 0.655496 0.143269
C  -4.378559 0.46897 2.499282
C  -4.092033 2.034622 0.239078
C  -4.466607 1.85097 2.59846
C  -4.321378 2.638377 1.468187
H  2.872291 0.711283 -2.481706
H  2.814844 0.380429 0.586407
H  1.740766 3.729585 -0.412489
H  2.694743 2.76114 0.707087
H  0.933703 2.732159 0.793891
H  0.32738 2.567878 -2.192028
H  -0.420892 1.460273 -1.043364
H  0.445423 0.829623 -2.443742
H  4.251918 2.933324 -1.391507
H  6.486345 3.187843 -0.90028
H  7.108447 1.97782 0.223267
H  7.463146 1.840087 -1.486238
H  6.4267 -0.540654 -1.475352
H  5.99591 -0.416377 0.21633
H  4.750874 -0.760071 -0.987159
H  1.058792 -3.496625 1.143271
H  1.191286 -3.495792 -0.616808
H  -1.282673 -2.208624 2.244006
H  -1.132516 -2.807607 -2.026183
H  -4.176022 -2.087995 2.166014
H  -4.849385 -2.042221 0.554552
H  -3.823271 0.197662 -0.821213
H  -4.490552 -0.139135 3.389369
H  -3.979806 2.641483 -0.649972
H  -4.647154 2.310336 3.561635
H  -4.387606 3.715801 1.542218
totalener: -1079.73103655 hartree
nucrepener: 2126.95489973 hartree
electener: -3206.68593628 hartree
oneelecener: -5692.36887497 hartree
twoeener: 2485.68293869 hartree
kineticenergy: 1074.90929866 hartree
xcener: -106.465653472684 hartree
chargesum: 0.0000000
charge: -0.262913 -0.397137 -0.257096 0.121756 0.000667 -0.135151 -0.271332 -0.258397 -0.244877 0.356899 -0.007165 -0.210662 -0.226692 0.057894 -0.079001 -0.270247 0.009788 0.228218 -0.112954 0.053910 -0.173964 -0.157580 -0.119543 -0.116536 -0.137742 0.103949 0.090526 0.086307 0.084411 0.095506 0.081437 0.086787 0.097506 0.092081 0.078315 0.083421 0.086668 0.090726 0.086561 0.088452 0.102606 0.109961 0.124904 0.146511 0.088720 0.108567 0.118333 0.103932 0.125386 0.123608 0.124676
qa: -0.2629 -0.3971 -0.2571 0.1218 0.0007 -0.1352 -0.2713 -0.2584 -0.2449 0.3569 -0.0072 -0.2107 -0.2267 0.0579 -0.0790 -0.2702 0.0098 0.2282 -0.1130 0.0539 -0.1740 -0.1576 -0.1195 -0.1165 -0.1377 0.1039 0.0905 0.0863 0.0844 0.0955 0.0814 0.0868 0.0975 0.0921 0.0783 0.0834 0.0867 0.0907 0.0866 0.0885 0.1026 0.1100 0.1249 0.1465 0.0887 0.1086 0.1183 0.1039 0.1254 0.1236 0.1247
va: 2.1224 2.1048 2.2997 3.7430 3.7935 3.8613 3.9057 3.9084 3.8955 4.1850 3.7463 3.9407 3.9370 3.8847 3.6906 4.0344 3.9536 3.6166 3.8500 3.7081 3.9810 3.9859 3.9461 3.9620 3.9643 1.0264 1.0287 1.0025 1.0059 1.0057 1.0031 1.0011 1.0218 1.0106 1.0100 0.9996 0.9987 1.0020 1.0009 1.0141 0.9925 1.0103 1.0182 1.0132 1.0112 1.0082 1.0224 1.0114 1.0004 1.0006 1.0000
dispcorr: -0.023940416 hartree
energy: -1079.754976961835
dipole: 21.34994 -21.22373 0.12621 15.77100 -15.57630 0.19470 -0.65586 1.39584 0.73998
magnitude: 0.77550 au
magnitude: 1.97117 debye
