program: Orca
programVersion: 5.0.2
elementType: O O O C C C C C C C C C C C C C C C C C C C C C C H H H H H H H H H H H H H H H H H H H H H H H H H H
charge: 0
multiplicity: 1
keywords: wb97x-d3
keywords: def2-TZVPP
keywords: def2/J RIJCOSX
keywords: DEFGRID2
keywords: scfconv7
keywords: smallprint printgap noloewdin
keywords: NOSOSCF
formula: C22H26O3
InChI: InChI=1/C22H26O3/c1-15(2)10-19-20(22(19,3)4)21(23)25-14-17-12-18(24-13-17)11-16-8-6-5-7-9-16/h5-10,12-13,19-20H,11,14H2,1-4H3
51 atoms
O  1.283824 -1.542908 -0.78229
O  2.602357 -1.509455 1.025889
O  -1.498907 -1.060647 2.590252
C  4.546254 -0.060164 -0.998609
C  3.943069 0.911033 -0.040194
C  3.039218 -0.031487 -0.802814
C  5.027032 0.444066 -2.338576
C  5.367932 -1.206171 -0.461524
C  3.91046 2.370915 -0.312532
C  2.318189 -1.092333 -0.068412
C  2.871789 3.178608 -0.092927
C  2.951798 4.64579 -0.39001
C  1.559376 2.713535 0.461012
C  0.436725 -2.511194 -0.156041
C  -0.544935 -1.871116 0.760221
C  -1.804332 -1.286848 0.411265
C  -0.420194 -1.69471 2.096514
C  -2.339702 -0.815257 1.561163
C  -3.61754 -0.11848 1.876921
C  -4.508023 -0.042804 0.666916
C  -4.530304 1.091957 -0.134946
C  -5.297035 -1.131143 0.307942
C  -5.326544 1.142194 -1.270571
C  -6.0933 -1.085868 -0.825406
C  -6.11014 0.052928 -1.618664
H  4.065889 0.637987 1.005592
H  2.481993 0.396933 -1.628115
H  4.411009 1.257577 -2.721806
H  5.015114 -0.359231 -3.07719
H  6.053323 0.810998 -2.267848
H  5.042325 -1.534505 0.522577
H  6.413824 -0.903226 -0.381728
H  5.326456 -2.065571 -1.13379
H  4.828063 2.808558 -0.696724
H  3.917649 4.928114 -0.807318
H  2.177479 4.944872 -1.100944
H  2.789621 5.238866 0.513445
H  1.558126 1.663903 0.743888
H  1.292918 3.294369 1.347386
H  0.754689 2.867757 -0.262581
H  1.033291 -3.25814 0.369129
H  -0.07506 -3.006453 -0.980451
H  -2.251281 -1.232884 -0.568248
H  0.36162 -1.951388 2.792181
H  -3.411635 0.887908 2.25513
H  -4.131455 -0.644679 2.687567
H  -3.917468 1.945278 0.129976
H  -5.282969 -2.024571 0.920937
H  -5.334535 2.034421 -1.882899
H  -6.703101 -1.939916 -1.089617
H  -6.732467 0.0904 -2.503025
totalener: -1079.73292645 hartree
nucrepener: 2095.01031258 hartree
electener: -3174.74323903 hartree
oneelecener: -5628.37126698 hartree
twoeener: 2453.62802795 hartree
kineticenergy: 1074.90807884 hartree
xcener: -106.466661268167 hartree
chargesum: 0.0000000
charge: -0.259591 -0.403987 -0.255578 0.121211 -0.008664 -0.117942 -0.270707 -0.261373 -0.244815 0.344482 -0.005848 -0.212083 -0.219184 0.061058 -0.088856 -0.243728 0.003182 0.165430 -0.053557 0.017556 -0.146029 -0.161560 -0.125338 -0.120954 -0.127178 0.103723 0.088823 0.085522 0.091302 0.088614 0.099908 0.082846 0.085489 0.091909 0.078641 0.083089 0.086692 0.086513 0.088624 0.086330 0.111891 0.102006 0.137259 0.151042 0.089520 0.096897 0.109312 0.112004 0.124458 0.125664 0.125975
qa: -0.2596 -0.4040 -0.2556 0.1212 -0.0087 -0.1179 -0.2707 -0.2614 -0.2448 0.3445 -0.0058 -0.2121 -0.2192 0.0611 -0.0889 -0.2437 0.0032 0.1654 -0.0536 0.0176 -0.1460 -0.1616 -0.1253 -0.1210 -0.1272 0.1037 0.0888 0.0855 0.0913 0.0886 0.0999 0.0828 0.0855 0.0919 0.0786 0.0831 0.0867 0.0865 0.0886 0.0863 0.1119 0.1020 0.1373 0.1510 0.0895 0.0969 0.1093 0.1120 0.1245 0.1257 0.1260
va: 2.1251 2.0913 2.3038 3.7363 3.8074 3.8336 3.9086 3.9049 3.8992 4.2016 3.7438 3.9417 3.9444 3.8625 3.6955 4.0099 3.9655 3.6950 3.8586 3.6747 3.9757 3.9832 3.9628 3.9556 3.9534 1.0284 1.0306 1.0055 1.0062 1.0020 1.0210 1.0025 1.0016 1.0108 1.0098 0.9993 0.9989 1.0133 1.0021 1.0013 1.0122 0.9941 1.0087 1.0136 1.0075 1.0069 1.0114 1.0105 1.0007 1.0001 0.9997
dispcorr: -0.023247470 hartree
energy: -1079.756173924448
dipole: 18.31831 -18.74213 -0.42381 14.44887 -14.12584 0.32304 -8.80683 8.18248 -0.62435
magnitude: 0.82084 au
magnitude: 2.08642 debye
