program: Orca
programVersion: 5.0.2
elementType: O O O C C C C C C C C C C C C C C C C C C C C C C H H H H H H H H H H H H H H H H H H H H H H H H H H
charge: 0
multiplicity: 1
keywords: wb97x-d3
keywords: def2-TZVPP
keywords: def2/J RIJCOSX
keywords: DEFGRID2
keywords: scfconv7
keywords: smallprint printgap noloewdin
keywords: NOSOSCF
formula: C22H26O3
InChI: InChI=1/C22H26O3/c1-15(2)10-19-20(22(19,3)4)21(23)25-14-17-12-18(24-13-17)11-16-8-6-5-7-9-16/h5-10,12-13,19-20H,11,14H2,1-4H3
51 atoms
O  1.331346 -1.640398 -0.253489
O  2.626453 -1.008673 1.457667
O  -1.46694 0.007059 2.705982
C  4.61931 -0.360606 -0.895649
C  4.030644 0.884641 -0.324282
C  3.110782 -0.23764 -0.752788
C  5.138722 -0.331296 -2.313689
C  5.397892 -1.289786 0.002714
C  4.051369 2.17304 -1.063973
C  2.362621 -0.98378 0.281939
C  3.054244 3.057517 -1.115862
C  3.192515 4.341402 -1.877522
C  1.735668 2.862762 -0.43143
C  0.463272 -2.330512 0.651557
C  -0.517935 -1.411089 1.289854
C  -1.806177 -1.039599 0.78801
C  -0.374251 -0.736888 2.455404
C  -2.336125 -0.179883 1.688881
C  -3.6289 0.557118 1.750445
C  -4.589698 0.059999 0.704966
C  -5.334611 -1.093447 0.929736
C  -4.726572 0.716879 -0.51153
C  -6.204329 -1.57463 -0.035476
C  -5.594676 0.237394 -1.482453
C  -6.337334 -0.908732 -1.245847
H  4.127604 0.969934 0.755617
H  2.571933 -0.096592 -1.682945
H  5.123386 -1.331585 -2.749409
H  6.172092 0.021594 -2.336535
H  4.552108 0.321978 -2.959754
H  5.320015 -2.321935 -0.3441
H  5.063585 -1.257001 1.036562
H  6.45476 -1.017669 -0.014226
H  4.977854 2.416764 -1.57703
H  4.16728 4.43277 -2.355211
H  2.428425 4.420368 -2.655051
H  3.05765 5.204629 -1.221303
H  1.533814 3.692986 0.249866
H  0.918349 2.853605 -1.157087
H  1.68117 1.942897 0.145655
H  1.045092 -2.867546 1.401414
H  -0.052323 -3.065141 0.034183
H  -2.275408 -1.379342 -0.121308
H  0.426441 -0.690592 3.174728
H  -3.455977 1.630242 1.620251
H  -4.06786 0.44286 2.746169
H  -5.229667 -1.620349 1.870758
H  -4.148665 1.613293 -0.702531
H  -6.780644 -2.470022 0.157259
H  -5.691084 0.762285 -2.423857
H  -7.017472 -1.28197 -2.000044
totalener: -1079.73283700 hartree
nucrepener: 2085.94671002 hartree
electener: -3165.67954702 hartree
oneelecener: -5610.24368456 hartree
twoeener: 2444.56413754 hartree
kineticenergy: 1074.90774154 hartree
xcener: -106.466599635520 hartree
chargesum: -0.0000000
charge: -0.260273 -0.406478 -0.254875 0.121704 -0.011483 -0.114513 -0.272859 -0.261238 -0.243157 0.346864 -0.006731 -0.211595 -0.218984 0.063757 -0.088122 -0.243787 0.000757 0.162823 -0.054120 0.015748 -0.158498 -0.146609 -0.120460 -0.125622 -0.127343 0.104103 0.087612 0.090707 0.089002 0.085711 0.086293 0.100823 0.082120 0.092116 0.078274 0.083744 0.086651 0.089162 0.084895 0.085235 0.113327 0.101591 0.137556 0.152626 0.088230 0.098347 0.112119 0.108972 0.125310 0.124673 0.125889
qa: -0.2603 -0.4065 -0.2549 0.1217 -0.0115 -0.1145 -0.2729 -0.2612 -0.2432 0.3469 -0.0067 -0.2116 -0.2190 0.0638 -0.0881 -0.2438 0.0008 0.1628 -0.0541 0.0157 -0.1585 -0.1466 -0.1205 -0.1256 -0.1273 0.1041 0.0876 0.0907 0.0890 0.0857 0.0863 0.1008 0.0821 0.0921 0.0783 0.0837 0.0867 0.0892 0.0849 0.0852 0.1133 0.1016 0.1376 0.1526 0.0882 0.0983 0.1121 0.1090 0.1253 0.1247 0.1259
va: 2.1283 2.0871 2.3048 3.7321 3.8115 3.8312 3.9109 3.9030 3.8988 4.1998 3.7439 3.9409 3.9444 3.8541 3.6976 4.0121 3.9621 3.6979 3.8549 3.6791 3.9851 3.9718 3.9545 3.9623 3.9532 1.0286 1.0308 1.0063 1.0015 1.0052 1.0013 1.0209 1.0028 1.0104 1.0099 0.9991 0.9989 1.0020 1.0014 1.0136 1.0112 0.9948 1.0083 1.0139 1.0061 1.0080 1.0101 1.0116 1.0001 1.0005 0.9997
dispcorr: -0.023087776 hartree
energy: -1079.755924774290
dipole: 18.97187 -19.37890 -0.40703 10.72228 -10.63261 0.08967 -12.76495 12.07942 -0.68553
magnitude: 0.80229 au
magnitude: 2.03926 debye
