program: Orca
programVersion: 5.0.2
elementType: O O O C C C C C C C C C C C C C C C C C C C C C C H H H H H H H H H H H H H H H H H H H H H H H H H H
charge: 0
multiplicity: 1
keywords: wb97x-d3
keywords: def2-TZVPP
keywords: def2/J RIJCOSX
keywords: DEFGRID2
keywords: scfconv7
keywords: smallprint printgap noloewdin
keywords: NOSOSCF
formula: C22H26O3
InChI: InChI=1/C22H26O3/c1-15(2)10-19-20(22(19,3)4)21(23)25-14-17-12-18(24-13-17)11-16-8-6-5-7-9-16/h5-10,12-13,19-20H,11,14H2,1-4H3
51 atoms
O  1.84216 -2.305075 -0.762421
O  1.800267 -1.340209 1.253403
O  -2.518513 -2.292098 -0.704495
C  4.067698 0.476715 0.126683
C  2.757458 1.159124 -0.094309
C  2.949229 -0.28116 -0.559206
C  5.248923 0.823672 -0.750799
C  4.476442 0.149667 1.543065
C  2.552729 2.239268 -1.078214
C  2.154066 -1.336644 0.101805
C  1.458366 2.994793 -1.199136
C  1.386836 4.084973 -2.226002
C  0.223288 2.843129 -0.365081
C  0.964704 -3.337911 -0.301143
C  -0.443991 -2.872436 -0.170685
C  -1.108981 -2.382383 0.997551
C  -1.360187 -2.791456 -1.165137
C  -2.361847 -2.046232 0.614908
C  -3.503686 -1.424955 1.334431
C  -3.690574 0.027636 0.963275
C  -2.815609 0.99076 1.455988
C  -4.712506 0.425403 0.111193
C  -2.967533 2.324628 1.114811
C  -4.864247 1.760355 -0.238247
C  -3.992178 2.713834 0.262857
H  2.151058 1.229021 0.802439
H  3.073481 -0.419602 -1.62699
H  5.727527 1.742177 -0.406172
H  4.979364 0.961852 -1.797285
H  5.993381 0.027198 -0.712638
H  5.128249 -0.725578 1.569347
H  3.629112 -0.046247 2.193997
H  5.035151 0.988947 1.961025
H  3.372243 2.436004 -1.762472
H  2.302317 4.159806 -2.811858
H  0.556975 3.91925 -2.917506
H  1.210988 5.056211 -1.756147
H  0.266363 2.015064 0.338792
H  0.022787 3.758084 0.199231
H  -0.650241 2.674554 -0.998972
H  1.324594 -3.751452 0.642533
H  1.044522 -4.115326 -1.060125
H  -0.688913 -2.283333 1.984513
H  -1.323836 -3.045957 -2.212455
H  -3.312659 -1.51373 2.405756
H  -4.423897 -1.98174 1.137753
H  -2.004924 0.691683 2.110545
H  -5.397744 -0.314868 -0.284055
H  -2.282877 3.062515 1.51256
H  -5.666051 2.054097 -0.903263
H  -4.110713 3.755542 -0.005247
totalener: -1079.73142398 hartree
nucrepener: 2160.32066148 hartree
electener: -3240.05208546 hartree
oneelecener: -5759.15987682 hartree
twoeener: 2519.10779135 hartree
kineticenergy: 1074.91560782 hartree
xcener: -106.468355263336 hartree
chargesum: -0.0000000
charge: -0.264236 -0.413508 -0.249102 0.109641 -0.019186 -0.056678 -0.277677 -0.251634 -0.176284 0.366246 -0.022214 -0.214047 -0.252815 0.048450 -0.074162 -0.237810 -0.031853 0.216770 -0.141173 0.082172 -0.147961 -0.149769 -0.163004 -0.120895 -0.121905 0.092817 0.075121 0.098845 0.072841 0.091230 0.081963 0.099836 0.083258 0.078111 0.076022 0.086138 0.083428 0.080563 0.080427 0.093099 0.108198 0.104815 0.136354 0.135220 0.109880 0.097753 0.114866 0.105888 0.128951 0.122757 0.124251
qa: -0.2642 -0.4135 -0.2491 0.1096 -0.0192 -0.0567 -0.2777 -0.2516 -0.1763 0.3662 -0.0222 -0.2140 -0.2528 0.0484 -0.0742 -0.2378 -0.0319 0.2168 -0.1412 0.0822 -0.1480 -0.1498 -0.1630 -0.1209 -0.1219 0.0928 0.0751 0.0988 0.0728 0.0912 0.0820 0.0998 0.0833 0.0781 0.0760 0.0861 0.0834 0.0806 0.0804 0.0931 0.1082 0.1048 0.1364 0.1352 0.1099 0.0978 0.1149 0.1059 0.1290 0.1228 0.1243
va: 2.1347 2.0864 2.3105 3.7793 3.8356 3.8254 3.9208 3.8939 3.9132 4.1930 3.8565 3.9360 3.9584 3.8980 3.6922 4.0180 3.9971 3.6131 3.8899 3.6268 3.9635 4.0082 3.9537 3.9641 3.9393 1.0238 1.0355 1.0005 1.0075 1.0047 1.0035 1.0248 1.0006 1.0170 1.0118 0.9985 0.9976 1.0135 0.9971 0.9962 1.0057 0.9959 1.0254 1.0067 1.0071 1.0122 1.0112 1.0122 0.9943 1.0002 1.0002
dispcorr: -0.024376995 hartree
energy: -1079.755800977151
dipole: 15.63286 -15.58899 0.04386 18.69565 -18.60465 0.09100 -2.24567 1.83371 -0.41195
magnitude: 0.42416 au
magnitude: 1.07813 debye
