program: Orca
programVersion: 5.0.2
elementType: O O O C C C C C C C C C C C C C C C C C C C C C C H H H H H H H H H H H H H H H H H H H H H H H H H H
charge: 0
multiplicity: 1
keywords: wb97x-d3
keywords: def2-TZVPP
keywords: def2/J RIJCOSX
keywords: DEFGRID2
keywords: scfconv7
keywords: smallprint printgap noloewdin
keywords: NOSOSCF
formula: C22H26O3
InChI: InChI=1/C22H26O3/c1-15(2)10-19-20(22(19,3)4)21(23)25-14-17-12-18(24-13-17)11-16-8-6-5-7-9-16/h5-10,12-13,19-20H,11,14H2,1-4H3
51 atoms
O  1.82644 -2.184474 -0.951288
O  2.41229 -1.845727 1.181113
O  -1.936399 -1.998498 1.232695
C  4.133677 0.523816 0.035018
C  2.792342 1.02151 0.447339
C  2.894069 -0.185603 -0.473875
C  4.902835 1.291912 -1.014193
C  5.022466 -0.122645 1.069342
C  2.187532 2.278656 -0.060598
C  2.389539 -1.47473 0.034972
C  0.886687 2.42849 -0.318622
C  0.332867 3.722072 -0.833564
C  -0.119607 1.333335 -0.13654
C  0.991647 -3.275913 -0.55483
C  -0.32648 -2.769597 -0.083067
C  -1.430474 -2.345497 -0.88943
C  -0.698961 -2.52471 1.195286
C  -2.377519 -1.88745 -0.038513
C  -3.717048 -1.275581 -0.249683
C  -3.707013 0.224943 -0.070373
C  -3.733237 0.788954 1.201469
C  -3.643382 1.068602 -1.173328
C  -3.695398 2.165201 1.365528
C  -3.606281 2.445935 -1.013634
C  -3.630527 2.998812 0.257818
H  2.517284 0.753915 1.465088
H  2.651686 0.00371 -1.51293
H  5.605229 0.636152 -1.531182
H  5.480178 2.097166 -0.554903
H  4.251405 1.738576 -1.765526
H  4.460415 -0.647989 1.836992
H  5.630276 0.640546 1.559373
H  5.704053 -0.837386 0.604433
H  2.852103 3.125049 -0.209986
H  -0.170706 3.573364 -1.792306
H  -0.419627 4.124178 -0.150862
H  1.106208 4.477139 -0.971382
H  -0.48445 0.974711 -1.102266
H  0.267335 0.474795 0.407172
H  -0.996501 1.698424 0.401271
H  1.479667 -3.885041 0.206749
H  0.876567 -3.882919 -1.452096
H  -1.499465 -2.376198 -1.965193
H  -0.19442 -2.662408 2.137263
H  -4.443835 -1.727509 0.431296
H  -4.045496 -1.525003 -1.259817
H  -3.781433 0.146737 2.072267
H  -3.621316 0.644635 -2.170424
H  -3.716237 2.588106 2.361403
H  -3.558268 3.087565 -1.883812
H  -3.602789 4.07302 0.385299
totalener: -1079.73109374 hartree
nucrepener: 2221.28741051 hartree
electener: -3301.01850426 hartree
oneelecener: -5881.06510153 hartree
twoeener: 2580.04659727 hartree
kineticenergy: 1074.91383337 hartree
xcener: -106.469721106975 hartree
chargesum: 0.0000000
charge: -0.265010 -0.400154 -0.255972 0.153230 -0.025600 -0.088154 -0.273886 -0.260892 -0.247654 0.316748 0.050163 -0.240627 -0.222196 0.068950 -0.074712 -0.290994 0.003293 0.234189 -0.135108 0.096167 -0.164514 -0.190309 -0.094546 -0.089058 -0.177718 0.101669 0.078188 0.090911 0.089864 0.083545 0.101144 0.081029 0.083484 0.091785 0.083630 0.086977 0.083708 0.088223 0.073816 0.078380 0.111168 0.099684 0.122360 0.150570 0.111274 0.093429 0.111379 0.104323 0.125244 0.122935 0.125649
qa: -0.2650 -0.4002 -0.2560 0.1532 -0.0256 -0.0882 -0.2739 -0.2609 -0.2477 0.3167 0.0502 -0.2406 -0.2222 0.0690 -0.0747 -0.2910 0.0033 0.2342 -0.1351 0.0962 -0.1645 -0.1903 -0.0945 -0.0891 -0.1777 0.1017 0.0782 0.0909 0.0899 0.0835 0.1011 0.0810 0.0835 0.0918 0.0836 0.0870 0.0837 0.0882 0.0738 0.0784 0.1112 0.0997 0.1224 0.1506 0.1113 0.0934 0.1114 0.1043 0.1252 0.1229 0.1256
va: 2.1119 2.0915 2.3001 3.7145 3.8338 3.8148 3.9079 3.8974 3.8870 4.2294 3.7127 3.9481 3.9655 3.8719 3.7010 4.0186 3.9532 3.5906 3.8738 3.5905 4.0023 3.9595 3.9019 3.8797 3.9425 1.0286 1.0364 1.0064 1.0012 1.0051 1.0228 1.0020 1.0025 1.0104 0.9978 1.0000 1.0130 0.9996 1.0226 1.0050 1.0123 0.9931 1.0185 1.0126 1.0069 1.0141 1.0207 1.0120 1.0002 1.0010 1.0025
dispcorr: -0.028749234 hartree
energy: -1079.759842977520
dipole: 11.66121 -12.16967 -0.50845 16.28120 -16.01117 0.27003 -4.39197 3.71003 -0.68194
magnitude: 0.89246 au
magnitude: 2.26844 debye
