program: Gaussian 09
title: 000073244
version: EM64L-G09RevD.01
frameworkgroup: C1[X(C16H15N3O2)]
method: RPBEPBE
basis: SDD
operation: Freq
keyword: #p
keyword: freq=noraman
keyword: PBEPBE/SDD
title: #p freq=noraman PBEPBE/SDD
converged: YES YES NO NO
title: Mulliken charges:
elementType: O O N N N C C C C C C C C C C C C C C C C H H H H H H H H H H H H H H H
charge: -0.234505 -0.250842 -0.231836 -0.140718 -0.376204 -0.496622 -0.483155 0.164252 0.168009 0.453215 0.433976 -0.323434 -0.344807 -0.224505 -0.233158 -0.413077 -0.321984 -0.243235 -0.198956 -0.224758 -0.258304 0.253473 0.286507 0.265348 0.290167 0.316237 0.279354 0.243722 0.230879 0.229391 0.228642 0.243101 0.233095 0.225771 0.225614 0.229346
chargesum: 0.00000
title: Mulliken charges with hydrogens summed into heavy atoms:
elementType: O O N N N C C C C C C C C C C C C C C C C
charge: -0.234505 -0.250842 -0.231836 -0.140718 -0.059967 0.043358 0.072361 0.164252 0.168009 0.453215 0.433976 -0.044080 -0.101086 0.006373 -0.003767 -0.184436 -0.078883 -0.010141 0.026816 0.000856 -0.028958
polarizability: 2.76424356e+02 -3.03971250e+00 1.96055823e+02 1.65742971e+01 4.89729377e-01 1.21667564e+02
1716.lowfreq: -5.6307 -0.0006 -0.0001 0.0004 1.6111 5.2041 17.6957 26.1952 41.5648
frequency: 17.5760 26.1656 41.5365 53.1440 59.8937 82.1863 127.1352 165.4526 175.2101 196.3178 221.8166 258.2219 285.4564 298.0137 324.6208 373.8576 404.3359 407.0741 427.4923 452.1696 455.5372 503.8887 513.8976 533.5320 554.7110 588.4029 612.0980 613.5034 630.8155 650.4366 692.6762 694.5635 702.1191 742.2835 756.0959 768.5327 812.4719 826.4533 832.7613 842.1596 890.5009 907.6261 913.3171 962.2674 967.0432 977.5576 981.7332 983.2777 984.2984 987.2675 992.5224 1023.2730 1032.1194 1074.6224 1086.2121 1094.1617 1125.4805 1171.8005 1176.5475 1183.6812 1194.6557 1200.8713 1217.1788 1227.8619 1247.3010 1275.2785 1282.0217 1288.9337 1317.6285 1333.1159 1371.6033 1380.8857 1389.3649 1400.9133 1436.9169 1443.6748 1458.6147 1477.8237 1483.9245 1487.2574 1500.9711 1590.2153 1597.8489 1603.4384 1610.8718 1617.5271 1621.4021 2959.3530 2965.5955 3089.1617 3102.3406 3122.3817 3131.6687 3131.7724 3141.7280 3144.2512 3154.8523 3156.4112 3168.8217 3170.3395 3202.4405 3463.7582
redmass: 5.5793 4.7060 3.8145 5.3699 6.7562 6.0257 3.8879 3.0185 4.1594 4.2317 4.9408 3.3774 3.7661 4.3264 4.6486 4.9040 2.8949 2.9128 7.8714 5.9727 2.5388 3.7043 3.4154 5.2440 3.4336 4.0199 6.2645 6.2142 4.6036 4.7726 1.9845 2.0221 5.2437 3.6623 1.7232 2.0544 4.3082 1.3583 1.2759 3.1835 1.4554 1.5136 3.3342 1.3719 1.3922 1.9826 2.8447 1.8971 2.0221 4.9355 1.3888 2.1542 2.1928 3.3382 1.6780 1.9160 3.2563 1.0483 1.0504 1.1206 1.5234 1.1387 1.4973 2.5765 2.3279 3.5179 2.1102 1.8148 1.3849 1.3262 2.8153 3.9772 4.7265 2.9593 2.1579 2.1775 1.1279 1.2242 2.3592 2.1608 1.4792 6.4338 5.9560 7.4745 7.0053 7.4323 6.8717 1.0692 1.0700 1.0917 1.0924 1.0865 1.0851 1.0866 1.0893 1.0929 1.0940 1.0946 1.1001 1.1012 1.0949 1.0754
irintensity: 0.0478 0.2311 0.9580 0.2408 5.4023 4.4973 7.1771 4.7502 4.0690 3.2742 0.4697 14.6813 1.6810 14.9012 4.6891 3.7664 0.9655 0.4274 1.6673 25.9897 99.7876 9.6284 16.3028 4.4568 8.5907 11.0848 0.8628 1.7941 3.4760 11.1273 36.8241 35.2909 0.0986 35.1125 56.8662 93.5989 8.7147 0.9338 1.4498 12.7671 6.6005 4.6720 8.9075 0.1336 0.1734 1.8826 4.3951 2.5348 8.5340 0.9154 0.1956 8.9653 12.4230 20.0387 12.1684 14.2305 23.7716 0.5182 0.4635 3.9732 19.7590 0.3305 68.7635 3.3239 26.3162 135.5567 140.5851 5.2245 2.9968 0.5552 35.8555 57.8906 14.7498 47.2733 2.3770 8.7251 52.8346 2.9456 100.9570 68.0494 19.5303 21.5294 44.2728 92.3043 186.8740 217.8375 101.1788 24.2002 25.8728 1.3943 1.1732 8.0328 2.0264 0.4872 9.5244 21.5138 31.9042 36.3282 19.4543 12.9531 0.7600 34.3541
temp: 298.150 k
press: 1.00000 atm
elementType: 8 8 7 7 7 6 6 6 6 6 6 6 6 6 6 6 6 6 6 6 6 1 1 1 1 1 1 1 1 1 1 1 1 1 1 1
symmnumber: 1
zpe: 738113.3 jmol-1
zpe.correction: 0.281133 hartree
zpe.thermalcorrener: 0.298891 hartree
zpe.thermalcorrenthalpy: 0.299835 hartree
zpe.thermalcorrgfe: 0.232929 hartree
zpe.sumelectzpe: -931.904195 hartree
zpe.sumelectthermal: -931.886437 hartree
zpe.sumelectthermalent: -931.885492 hartree
zpe.sumelectthermalfe: -931.952399 hartree
dipole: -0.9224 1.1569 0.1477
dipole: 1.4870
quadrupole: -104.3776 -118.0335 -133.0469
quadrupole: -3.8021 8.1466 13.1396
quadrupole: 14.1084 0.4525 -14.5609 -3.8021 8.1466 13.1396
hfenergy: -932.1853278 hartree
pointgroup: C01 [X(C16H15N3O2)]
dipole: 0.3579406 -0.455869 -0.0795084 debye
polarizability: 275.8410274|1.431335|190.3095579|-19.1164433|19.9428388|127.9971581 unknown
InChI: InChI=1S/C16H15N3O2/c20-15-12-19(17-13-7-3-1-4-8-13)16(21)11-18(15)14-9-5-2-6-10-14/h1-10,17H,11-12H2
charge 0 multiplicity 1
36 atoms
O  1.308195 0.626353 2.291537
O  -0.88421 -2.21438 -1.831866
N  1.647619 -0.502123 0.247076
N  -1.087198 -1.166672 0.241338
N  -2.490274 -1.336568 0.241864
C  1.165034 -1.582938 -0.652099
C  -0.44779 -0.863626 1.537633
C  0.914247 -0.168591 1.391299
C  -0.353817 -1.668367 -0.819042
C  2.958067 0.051405 -0.023549
C  -3.317554 -0.186617 0.053287
C  3.276504 1.387215 0.336894
C  3.930029 -0.742447 -0.687184
C  4.549346 1.910886 0.030027
C  5.199139 -0.204979 -0.9920
C  -4.71729 -0.389202 -0.082067
C  -2.794745 1.13162 0.056744
C  5.517304 1.123975 -0.636007
C  -5.57757 0.717822 -0.221527
C  -3.670874 2.232005 -0.072756
C  -5.063177 2.03719 -0.212445
H  1.531691 -2.575944 -0.315605
H  1.567197 -1.411204 -1.66289
H  -0.325714 -1.784409 2.145881
H  -1.097605 -0.18008 2.104137
H  -2.763039 -2.178561 -0.281129
H  2.543338 2.000811 0.86183
H  3.717409 -1.7825 -0.954156
H  4.782203 2.943415 0.312236
H  5.938694 -0.831037 -1.502949
H  -5.12437 -1.407546 -0.074125
H  -1.715498 1.297074 0.133188
H  6.502654 1.539525 -0.871692
H  -6.654604 0.549582 -0.333045
H  -3.256887 3.246599 -0.072151
H  -5.736053 2.894615 -0.315388
