program: Orca
programVersion: 5.0.2
elementType: O O O C C C C C C C C C C C C C C C C C C C H H H H H H H H H H H H H H H H H H H H H H H H
charge: 0
multiplicity: 1
keywords: wb97x-d3
keywords: def2-TZVPP
keywords: def2/J RIJCOSX
keywords: DEFGRID2
keywords: scfconv7
keywords: smallprint printgap noloewdin
keywords: NOSOSCF
formula: C19H24O3
InChI: InChI=1/C19H24O3/c1-7-8-13-12(4)16(10-15(13)20)22-18(21)17-14(9-11(2)3)19(17,5)6/h1,9,14,16-17H,8,10H2,2-6H3
46 atoms
O  -0.577145 -0.551264 1.718134
O  -0.155598 0.366873 -0.276327
O  3.701479 -1.762594 0.120902
C  -3.194672 1.09741 -0.284388
C  -3.09883 -0.251529 -0.902615
C  -2.417921 0.013375 0.444909
C  -2.495166 2.28101 -0.903986
C  -4.506715 1.468571 0.366538
C  -2.336865 -0.502743 -2.151457
C  -0.953828 -0.012871 0.548586
C  -1.745884 -1.656618 -2.47123
C  0.809144 -0.768444 1.97416
C  -1.047216 -1.839039 -3.783546
C  -1.718357 -2.846297 -1.563391
C  1.48269 -1.827621 1.105895
C  1.674733 0.457349 1.840175
C  2.814895 0.181332 1.1893
C  2.801723 -1.201769 0.717311
C  1.275295 1.757375 2.427427
C  3.93775 1.132362 0.905056
C  3.542678 2.135102 -0.077672
C  3.187035 2.957048 -0.879575
H  -3.978947 -0.877355 -0.779627
H  -2.923943 -0.412512 1.302786
H  -1.583561 2.031463 -1.43889
H  -3.167809 2.76583 -1.613837
H  -2.241882 3.017586 -0.139499
H  -4.359402 2.212283 1.151664
H  -5.189376 1.894618 -0.371175
H  -4.998373 0.603678 0.81303
H  -2.296427 0.311524 -2.869404
H  0.818839 -1.076121 3.021967
H  0.913074 -2.068467 0.205449
H  1.644448 -2.764557 1.639378
H  0.008383 -2.079197 -3.633044
H  -1.476268 -2.674018 -4.343199
H  -1.106076 -0.948372 -4.40858
H  -2.167553 -2.656347 -0.590239
H  -2.245714 -3.690305 -2.015715
H  -0.690464 -3.180706 -1.400064
H  0.689733 2.333397 1.706636
H  2.140801 2.361857 2.696078
H  0.655376 1.622858 3.313133
H  4.255448 1.633649 1.823331
H  4.808344 0.585909 0.536249
H  2.875427 3.689724 -1.589522
elementType: O C H
totalener: -964.15742861 hartree
nucrepener: 1856.25322821 hartree
electener: -2820.41065683 hartree
oneelecener: -4998.52987347 hartree
twoeener: 2178.11921664 hartree
cpcmener: -0.04431452 hartree
kineticenergy: 959.77879238 hartree
xcener: -94.702661030925 hartree
chargesum: 0.0000000
charge: -0.308486 -0.487330 -0.488548 0.135694 -0.010084 -0.126563 -0.303463 -0.264739 -0.285982 0.407617 -0.011959 0.300435 -0.225121 -0.283696 -0.156179 0.011384 -0.148957 0.310922 -0.276656 -0.100486 -0.445619 0.017680 0.117784 0.094915 0.094959 0.102137 0.100826 0.095900 0.094488 0.088343 0.125413 0.122936 0.112724 0.110211 0.095989 0.096315 0.089539 0.096407 0.116302 0.094854 0.116886 0.117072 0.119082 0.136414 0.109265 0.291371
qa: -0.3085 -0.4873 -0.4885 0.1357 -0.0101 -0.1266 -0.3035 -0.2647 -0.2860 0.4076 -0.0120 0.3004 -0.2251 -0.2837 -0.1562 0.0114 -0.1490 0.3109 -0.2767 -0.1005 -0.4456 0.0177 0.1178 0.0949 0.0950 0.1021 0.1008 0.0959 0.0945 0.0883 0.1254 0.1229 0.1127 0.1102 0.0960 0.0963 0.0895 0.0964 0.1163 0.0949 0.1169 0.1171 0.1191 0.1364 0.1093 0.2914
va: 2.1205 2.0023 2.0119 3.7323 3.8151 3.8587 3.9003 3.8983 3.8626 4.0666 3.6863 3.7699 3.9241 3.9443 3.8780 3.6546 3.5289 4.0381 3.9357 3.8876 3.8042 3.5623 1.0033 1.0331 1.0142 0.9986 1.0008 1.0021 1.0019 1.0049 0.9991 0.9916 1.0235 1.0239 0.9967 0.9957 1.0071 1.0054 0.9991 0.9970 0.9981 0.9962 1.0048 0.9897 1.0207 0.9445
dispcorr: -0.024490757 hartree
energy: -964.181919371049
dipole: -18.64677 16.34150 -2.30528 2.26258 -1.78325 0.47932 -6.52558 8.49005 1.96446
magnitude: 3.06646 au
magnitude: 7.79432 debye
