program: Orca
programVersion: 5.0.2
elementType: O O O C C C C C C C C C C C C C C C C C C C H H H H H H H H H H H H H H H H H H H H H H H H
charge: 0
multiplicity: 1
keywords: wb97x-d3
keywords: def2-TZVPP
keywords: def2/J RIJCOSX
keywords: DEFGRID2
keywords: scfconv7
keywords: smallprint printgap noloewdin
keywords: NOSOSCF
formula: C19H24O3
InChI: InChI=1/C19H24O3/c1-7-8-13-12(4)16(10-15(13)20)22-18(21)17-14(9-11(2)3)19(17,5)6/h1,9,14,16-17H,8,10H2,2-6H3
46 atoms
O  -0.640719 0.113296 0.86074
O  -1.575728 -1.2931 2.312085
O  3.151966 -1.758821 -0.552648
C  -3.379791 0.858936 -0.157401
C  -2.995356 -0.364937 -0.912975
C  -2.935894 -0.365913 0.62254
C  -2.551526 2.118907 -0.231502
C  -4.85832 1.15309 -0.040596
C  -1.780679 -0.441014 -1.762173
C  -1.674315 -0.557242 1.351682
C  -1.16551 -1.578122 -2.096981
C  0.652447 -0.122933 1.425022
C  0.017086 -1.589248 -3.014846
C  -1.605732 -2.919808 -1.594129
C  1.268668 -1.433351 0.946357
C  1.54429 0.956836 0.869508
C  2.531391 0.448921 0.118587
C  2.425362 -1.011999 0.072438
C  1.30817 2.38144 1.199555
C  3.615103 1.208126 -0.58636
C  4.485238 1.9169 0.344195
C  5.187008 2.506834 1.121668
H  -3.827647 -0.964278 -1.272692
H  -3.740269 -0.912229 1.100721
H  -1.506987 1.958863 -0.481004
H  -2.968925 2.772564 -0.999815
H  -2.592037 2.662899 0.713618
H  -5.203343 1.718396 -0.908297
H  -5.453058 0.241038 0.019484
H  -5.068964 1.74862 0.849574
H  -1.398324 0.491184 -2.167115
H  0.601115 -0.054414 2.514252
H  0.572333 -2.064691 0.391094
H  1.648696 -2.028932 1.778339
H  0.269658 -0.592139 -3.374946
H  0.895966 -2.003068 -2.513467
H  -0.167468 -2.226146 -3.884016
H  -2.223354 -3.431133 -2.338227
H  -0.746618 -3.567083 -1.407708
H  -2.186414 -2.858883 -0.674193
H  1.776503 3.054786 0.483797
H  1.726848 2.600318 2.185698
H  0.244331 2.612997 1.250107
H  4.214006 0.52323 -1.190521
H  3.17706 1.927419 -1.283835
H  5.814988 3.025846 1.810514
elementType: O C H
totalener: -964.15737592 hartree
nucrepener: 1868.86546254 hartree
electener: -2833.02283847 hartree
oneelecener: -5022.29936970 hartree
twoeener: 2189.27653123 hartree
cpcmener: -0.03928627 hartree
kineticenergy: 959.77996521 hartree
xcener: -94.700746289042 hartree
chargesum: 0.0000000
charge: -0.265214 -0.505052 -0.481778 0.152924 -0.022658 -0.135042 -0.298362 -0.271107 -0.257396 0.412010 -0.033506 0.237541 -0.233869 -0.282729 -0.137355 -0.029536 -0.071349 0.288016 -0.271741 -0.102949 -0.464445 0.045108 0.115111 0.094537 0.079722 0.102081 0.108542 0.094901 0.088174 0.096770 0.127300 0.113289 0.105757 0.122500 0.092146 0.085173 0.107067 0.119173 0.095798 0.097991 0.107766 0.126685 0.109347 0.110024 0.136877 0.291760
qa: -0.2652 -0.5051 -0.4818 0.1529 -0.0227 -0.1350 -0.2984 -0.2711 -0.2574 0.4120 -0.0335 0.2375 -0.2339 -0.2827 -0.1374 -0.0295 -0.0713 0.2880 -0.2717 -0.1029 -0.4644 0.0451 0.1151 0.0945 0.0797 0.1021 0.1085 0.0949 0.0882 0.0968 0.1273 0.1133 0.1058 0.1225 0.0921 0.0852 0.1071 0.1192 0.0958 0.0980 0.1078 0.1267 0.1093 0.1100 0.1369 0.2918
va: 2.1137 1.9898 2.0068 3.7182 3.7927 3.8727 3.9049 3.9026 3.8153 4.1082 3.6899 3.7594 3.9168 3.9366 3.8926 3.7375 3.5213 4.0014 3.9436 3.8826 3.8214 3.5270 1.0029 1.0278 1.0056 1.0013 0.9975 1.0022 1.0051 1.0014 0.9997 1.0189 1.0172 1.0175 1.0070 1.0050 0.9962 0.9970 0.9993 1.0038 0.9964 0.9941 1.0087 1.0215 0.9885 0.9438
dispcorr: -0.026259434 hartree
energy: -964.183635355936
dipole: -15.11127 13.76729 -1.34398 4.62980 -2.60061 2.02920 -9.11798 8.81467 -0.30331
magnitude: 2.45274 au
magnitude: 6.23436 debye
