program: Orca
programVersion: 5.0.2
elementType: O O O C C C C C C C C C C C C C C C C C C C H H H H H H H H H H H H H H H H H H H H H H H H
charge: 0
multiplicity: 1
keywords: wb97x-d3
keywords: def2-TZVPP
keywords: def2/J RIJCOSX
keywords: DEFGRID2
keywords: scfconv7
keywords: smallprint printgap noloewdin
keywords: NOSOSCF
formula: C19H24O3
InChI: InChI=1/C19H24O3/c1-7-8-13-12(4)16(10-15(13)20)22-18(21)17-14(9-11(2)3)19(17,5)6/h1,9,14,16-17H,8,10H2,2-6H3
46 atoms
O  -0.657042 0.114056 0.870053
O  -1.586383 -1.254474 2.36027
O  3.181822 -1.858315 -0.35201
C  -3.425948 0.827768 -0.119441
C  -2.984056 -0.355036 -0.908366
C  -2.942234 -0.404754 0.625881
C  -2.64443 2.119232 -0.131093
C  -4.916042 1.059838 -0.011474
C  -1.756157 -0.356119 -1.742218
C  -1.685991 -0.553202 1.37427
C  -1.094941 -1.453948 -2.117739
C  0.636103 -0.089625 1.44645
C  0.116357 -1.37403 -2.994067
C  -1.489375 -2.835006 -1.694857
C  1.251587 -1.429985 1.056889
C  1.527524 0.94942 0.816813
C  2.518773 0.391216 0.108052
C  2.426484 -1.06908 0.180462
C  1.29073 2.393331 1.044814
C  3.598147 1.103358 -0.650652
C  4.49854 1.839778 0.228035
C  5.224121 2.452258 0.965092
H  -3.789245 -0.971808 -1.298407
H  -3.730181 -0.993955 1.079922
H  -1.595615 2.010177 -0.391194
H  -3.087731 2.796416 -0.863742
H  -2.699847 2.612397 0.840847
H  -5.160657 1.615376 0.895785
H  -5.273713 1.64079 -0.863646
H  -5.47437 0.123357 0.009798
H  -1.392312 0.606094 -2.089647
H  0.587562 0.051571 2.528968
H  0.562913 -2.083424 0.517175
H  1.604574 -1.984749 1.927702
H  0.334411 -0.352013 -3.303389
H  0.99651 -1.767619 -2.478259
H  -0.008166 -1.980829 -3.894771
H  -0.618725 -3.394431 -1.343103
H  -2.236676 -2.843313 -0.902221
H  -1.894767 -3.398673 -2.540576
H  0.227411 2.632177 1.059482
H  1.776229 3.015625 0.294998
H  1.691067 2.675898 2.02235
H  4.173957 0.38546 -1.238766
H  3.154199 1.798821 -1.368213
H  5.872151 2.986526 1.622676
elementType: O C H
totalener: -964.15744906 hartree
nucrepener: 1871.11187235 hartree
electener: -2835.26932141 hartree
oneelecener: -5026.72099921 hartree
twoeener: 2191.45167780 hartree
cpcmener: -0.04007850 hartree
kineticenergy: 959.77939670 hartree
xcener: -94.700836980392 hartree
chargesum: -0.0000000
charge: -0.264992 -0.504415 -0.482380 0.151998 -0.022937 -0.137842 -0.294877 -0.271377 -0.253494 0.415799 -0.033994 0.234497 -0.239024 -0.276140 -0.137355 -0.030467 -0.077306 0.290284 -0.267888 -0.107697 -0.464385 0.049989 0.115022 0.094125 0.078155 0.101381 0.108999 0.096698 0.094869 0.088188 0.127436 0.114089 0.108162 0.120729 0.093012 0.088157 0.106337 0.094357 0.095822 0.115653 0.110871 0.106698 0.126087 0.110498 0.136998 0.291657
qa: -0.2650 -0.5044 -0.4824 0.1520 -0.0229 -0.1378 -0.2949 -0.2714 -0.2535 0.4158 -0.0340 0.2345 -0.2390 -0.2761 -0.1374 -0.0305 -0.0773 0.2903 -0.2679 -0.1077 -0.4644 0.0500 0.1150 0.0941 0.0782 0.1014 0.1090 0.0967 0.0949 0.0882 0.1274 0.1141 0.1082 0.1207 0.0930 0.0882 0.1063 0.0944 0.0958 0.1157 0.1109 0.1067 0.1261 0.1105 0.1370 0.2917
va: 2.1116 1.9933 2.0062 3.7182 3.7939 3.8749 3.9053 3.9047 3.8249 4.1028 3.6949 3.7695 3.9176 3.9392 3.8862 3.7421 3.5080 3.9979 3.9420 3.8857 3.8272 3.5214 1.0033 1.0273 1.0056 1.0015 0.9975 1.0013 1.0021 1.0050 0.9991 1.0171 1.0180 1.0179 1.0063 1.0039 0.9977 0.9979 1.0044 0.9980 1.0076 0.9977 0.9942 1.0208 0.9885 0.9439
dispcorr: -0.026388465 hartree
energy: -964.183837527983
dipole: -15.03145 13.64743 -1.38402 5.12584 -3.02966 2.09618 -9.57162 9.10591 -0.46571
magnitude: 2.55468 au
magnitude: 6.49347 debye
