program: Orca
programVersion: 5.0.2
elementType: O O O C C C C C C C C C C C C C C C C C C C H H H H H H H H H H H H H H H H H H H H H H H H
charge: 0
multiplicity: 1
keywords: wb97x-d3
keywords: def2-TZVPP
keywords: def2/J RIJCOSX
keywords: DEFGRID2
keywords: scfconv7
keywords: smallprint printgap noloewdin
keywords: NOSOSCF
formula: C19H24O3
InChI: InChI=1/C19H24O3/c1-7-8-13-12(4)16(10-15(13)20)22-18(21)17-14(9-11(2)3)19(17,5)6/h1,9,14,16-17H,8,10H2,2-6H3
46 atoms
O  0.051509 -0.650663 0.963892
O  -1.281829 1.144773 0.871669
O  4.152102 -1.266513 2.918108
C  -3.483342 -0.899226 0.033958
C  -2.857071 -0.51459 -1.268606
C  -1.97165 -0.947597 -0.093996
C  -4.17014 0.127598 0.899445
C  -4.150302 -2.252951 0.097823
C  -2.871767 0.85924 -1.802289
C  -1.076651 -0.019575 0.613851
C  -3.049669 1.199684 -3.084791
C  1.049479 0.046051 1.714442
C  -3.068157 2.643409 -3.489832
C  -3.253615 0.244791 -4.220789
C  1.76341 -0.926553 2.643728
C  2.127695 0.586162 0.805932
C  3.343787 0.174833 1.195117
C  3.226745 -0.741702 2.330936
C  1.800025 1.478218 -0.3300
C  4.670103 0.529935 0.595668
C  5.029717 -0.3764 -0.488167
C  5.312612 -1.130779 -1.379638
H  -2.90046 -1.291715 -2.023021
H  -1.55671 -1.942787 -0.198778
H  -5.228837 0.164083 0.636553
H  -4.105882 -0.153957 1.951909
H  -3.777981 1.135069 0.800637
H  -3.644728 -2.986252 -0.5313
H  -4.157318 -2.63629 1.119888
H  -5.18651 -2.183595 -0.238591
H  -2.746754 1.668821 -1.093612
H  0.593248 0.86681 2.27198
H  1.478597 -1.960751 2.438082
H  1.562369 -0.737083 3.698299
H  -2.293281 2.851541 -4.231893
H  -4.019877 2.907176 -3.95804
H  -2.912743 3.311874 -2.64364
H  -3.208058 -0.803065 -3.937133
H  -4.224123 0.415718 -4.69219
H  -2.504135 0.410064 -4.997556
H  2.690233 1.824794 -0.850504
H  1.238902 2.348844 0.013556
H  1.169997 0.962236 -1.057841
H  4.658346 1.554782 0.219794
H  5.44427 0.495423 1.366121
H  5.570056 -1.789446 -2.177333
elementType: O C H
totalener: -964.16121832 hartree
nucrepener: 1759.91383697 hartree
electener: -2724.07505530 hartree
oneelecener: -4804.78473971 hartree
twoeener: 2080.70968441 hartree
cpcmener: -0.03919198 hartree
kineticenergy: 959.77505507 hartree
xcener: -94.700290094165 hartree
chargesum: -0.0000000
charge: -0.299236 -0.496224 -0.480728 0.106981 0.035293 -0.101075 -0.287829 -0.263485 -0.301920 0.414650 -0.056733 0.252423 -0.217897 -0.254066 -0.135216 -0.022993 -0.098182 0.315239 -0.245074 -0.112044 -0.451439 0.038137 0.121595 0.096659 0.097885 0.103866 0.095024 0.088665 0.094127 0.095026 0.120998 0.106316 0.103595 0.102813 0.093376 0.093463 0.088555 0.089231 0.097644 0.095969 0.103151 0.118781 0.113410 0.132210 0.117321 0.291737
qa: -0.2992 -0.4962 -0.4807 0.1070 0.0353 -0.1011 -0.2878 -0.2635 -0.3019 0.4146 -0.0567 0.2524 -0.2179 -0.2541 -0.1352 -0.0230 -0.0982 0.3152 -0.2451 -0.1120 -0.4514 0.0381 0.1216 0.0967 0.0979 0.1039 0.0950 0.0887 0.0941 0.0950 0.1210 0.1063 0.1036 0.1028 0.0934 0.0935 0.0886 0.0892 0.0976 0.0960 0.1032 0.1188 0.1134 0.1322 0.1173 0.2917
va: 2.1288 1.9934 2.0174 3.7074 3.7287 3.8827 3.9043 3.9080 3.8473 4.0709 3.7920 3.7651 3.9199 3.9382 3.9127 3.7525 3.5304 4.0390 3.9375 3.8834 3.8246 3.5393 1.0000 1.0301 1.0010 0.9984 1.0133 1.0054 1.0020 1.0016 1.0222 1.0285 1.0287 1.0226 0.9965 0.9961 1.0087 1.0140 0.9967 0.9971 1.0053 1.0045 0.9997 0.9912 1.0126 0.9440
dispcorr: -0.021178247 hartree
energy: -964.182396572033
dipole: -26.20042 24.39694 -1.80348 4.66674 -4.33372 0.33302 -16.54967 15.16101 -1.38866
magnitude: 2.30040 au
magnitude: 5.84714 debye
