program: Gaussian 09
title: 000062039
version: EM64L-G09RevD.01
frameworkgroup: C1[X(C16H22Cl2O3)]
method: RPBEPBE
basis: SDD
operation: Freq
keyword: #p
keyword: freq=noraman
keyword: PBEPBE/SDD
title: #p freq=noraman PBEPBE/SDD
converged: YES YES NO NO
title: Mulliken charges:
elementType: Cl Cl O O O C C C C C C C C C C C C C C C C H H H H H H H H H H H H H H H H H H H H H H
charge: -0.026321 -0.045917 -0.256002 -0.263673 -0.237461 -0.016662 -0.449431 -0.020121 -0.382156 -0.391882 -0.710780 -0.722235 -0.725051 0.274334 -0.418235 0.444116 -0.275593 -0.273405 -0.207298 -0.210479 -0.098950 0.239546 0.203611 0.194134 0.192064 0.201134 0.213811 0.238045 0.234587 0.212639 0.207499 0.218746 0.220922 0.213303 0.210807 0.218970 0.219428 0.230767 0.251368 0.263979 0.285035 0.281198 0.261607
chargesum: 0.00000
title: Mulliken charges with hydrogens summed into heavy atoms:
elementType: Cl Cl O O O C C C C C C C C C C C C C C C C
charge: -0.026321 -0.045917 -0.256002 -0.263673 -0.237461 0.222883 -0.051686 0.171942 0.032789 0.080751 -0.071896 -0.077202 -0.055886 0.274334 0.097112 0.444116 -0.275593 0.011630 0.073901 0.051128 -0.098950
polarizability: 2.54159053e+02 -1.68525421e+01 2.10557901e+02 -1.97082233e+01 -1.52925873e+00 1.39525553e+02
1716.lowfreq: -0.0020 -0.0017 -0.0010 0.6797 4.1718 9.6318 11.8830 16.8237 22.5321
frequency: 11.1995 16.7038 22.4531 35.7013 39.8413 57.9554 64.8702 94.8666 108.9286 125.0278 159.6976 162.0872 169.4704 182.1858 194.7100 215.2356 221.7567 237.4774 246.2106 264.2295 271.9699 288.3939 306.6590 345.7401 355.3183 366.5931 373.7147 388.1666 409.2917 452.2217 486.0138 492.8316 520.0953 538.8334 566.4134 579.3944 616.0116 645.8940 674.7453 708.6996 747.9292 773.4272 791.4609 796.6518 824.7018 829.1252 857.7617 881.1908 906.0929 916.3840 946.3799 950.5212 960.7659 974.2606 980.1523 996.7637 998.8295 1005.3092 1030.3772 1050.8371 1074.3340 1085.5288 1128.0595 1132.7866 1135.1387 1146.6502 1166.4617 1197.7681 1204.8833 1230.3097 1236.2246 1240.4425 1242.1987 1278.8326 1287.8062 1314.5775 1334.0622 1337.7080 1343.9580 1350.6284 1366.0009 1366.5962 1368.2072 1376.6070 1380.5753 1392.4305 1398.1886 1432.6516 1449.9378 1452.8238 1464.4844 1469.5912 1471.0689 1480.5074 1484.3931 1488.6263 1491.6241 1496.3327 1567.4062 1582.8969 1654.8013 2944.8637 2963.9790 2971.8112 2976.6899 2979.8063 2984.0632 2995.4403 3010.2659 3010.9685 3026.6637 3036.5322 3061.5352 3066.9565 3069.0063 3072.0124 3082.6622 3085.4282 3090.4990 3102.3742 3170.5367 3182.2440 3190.9860
redmass: 4.6345 7.7129 4.5996 5.9248 4.9787 3.7989 5.7298 5.0772 2.5391 3.2953 3.7564 5.7668 3.8767 4.1049 3.5273 1.7185 1.1430 3.4870 1.7248 1.4432 4.5770 2.3855 5.0984 4.7436 1.9170 4.3037 3.6896 2.9697 3.8191 3.9077 6.4868 4.1216 2.2392 3.1834 3.0734 3.0122 7.0198 5.5636 7.4110 3.7630 2.9532 1.3292 3.6847 3.4347 1.7303 2.9441 1.3907 1.7281 3.0174 1.3805 1.9299 1.4404 1.5442 2.1271 1.6234 2.0379 4.9644 2.3451 3.9622 1.6369 2.2386 1.6761 2.2482 1.9315 2.0877 2.0154 2.3624 1.9419 2.0812 1.2879 1.4552 1.3401 1.2607 1.1819 1.1117 1.4574 1.3512 1.4203 1.4665 5.4792 1.3214 1.3785 1.3224 4.5381 1.2179 1.2237 1.2182 1.2192 1.1009 2.0635 1.0560 1.0704 1.0563 1.0594 1.0500 1.0522 1.0589 1.0542 8.7847 7.1657 9.6143 1.0715 1.0690 1.0358 1.0391 1.0759 1.0367 1.0699 1.0614 1.0970 1.0583 1.0990 1.0995 1.0992 1.0992 1.0990 1.0984 1.0990 1.1009 1.1075 1.0897 1.0933 1.0970
irintensity: 0.0077 0.0169 0.1160 1.2003 0.1064 0.5603 1.0210 3.3166 0.0465 1.6252 1.4894 0.5431 0.2544 1.1508 3.2081 3.8540 0.7812 3.6700 1.5791 0.3180 1.7611 3.6310 4.0713 17.6360 0.0347 1.0526 1.6450 1.1127 1.3085 11.7750 10.9428 2.4775 4.1324 4.7741 8.7346 11.8876 33.1984 13.0072 25.2310 12.5015 3.8581 20.1518 31.8175 10.7106 32.2051 13.1579 25.1860 1.5065 23.2698 3.7079 9.4522 3.2830 0.6812 5.7648 7.0185 34.0860 92.6948 12.1461 175.6189 1.8009 42.0180 2.2890 293.9443 153.0899 6.2637 1.2105 8.3315 7.5583 36.4395 15.5714 25.4415 8.6446 2.3436 0.2709 7.9417 2.2763 20.2860 2.1079 1.9123 3.0972 1.0233 1.0059 0.4300 11.2059 18.2982 22.1960 16.8810 29.9993 13.1683 204.1819 6.3213 10.3055 1.0562 2.4453 1.7630 20.5362 37.2786 3.7178 12.8415 11.8102 147.8677 12.5115 62.2145 34.6713 16.9243 4.6346 30.5804 21.3562 18.5048 57.7680 29.5557 25.8484 31.9759 35.9914 60.3426 56.1340 98.4779 15.0632 6.8099 15.5394 1.0685 0.6401 0.2150
temp: 298.150 k
press: 1.00000 atm
elementType: 17 17 8 8 8 6 6 6 6 6 6 6 6 6 6 6 6 6 6 6 6 1 1 1 1 1 1 1 1 1 1 1 1 1 1 1 1 1 1 1 1 1 1
symmnumber: 1
zpe: 911649.9 jmol-1
zpe.correction: 0.347229 hartree
zpe.thermalcorrener: 0.370695 hartree
zpe.thermalcorrenthalpy: 0.371640 hartree
zpe.thermalcorrgfe: 0.290122 hartree
zpe.sumelectzpe: -1767.050869 hartree
zpe.sumelectthermal: -1767.027402 hartree
zpe.sumelectthermalent: -1767.026458 hartree
zpe.sumelectthermalfe: -1767.107975 hartree
dipole: -3.7045 0.1065 -1.3352
dipole: 3.9392
quadrupole: -139.7131 -139.1547 -143.3220
quadrupole: 1.9272 -0.0091 -1.3401
quadrupole: 1.0168 1.5752 -2.5921 1.9272 -0.0091 -1.3401
hfenergy: -1767.3980977 hartree
pointgroup: C01 [X(C16H22Cl2O3)]
dipole: 1.4919181 -0.1975928 0.3702006 debye
polarizability: 249.5021409|31.8442928|184.5072917|-10.4263254|33.3860925|170.233074 unknown
InChI: InChI=1S/C16H22Cl2O3/c1-4-12(7-11(2)3)9-21-16(19)10-20-15-6-5-13(17)8-14(15)18/h5-6,8,11-12H,4,7,9-10H2,1-3H3
charge 0 multiplicity 1
43 atoms
Cl -4.011853 2.030009 1.951874
Cl -6.567746 -2.518037 0.04981
O  1.114455 0.349677 1.228949
O  -2.023487 1.442842 -0.34586
O  0.063862 -0.470378 -0.696473
C  3.401148 0.052457 0.233967
C  4.465116 -1.051885 -0.04253
C  5.618027 -0.740475 -1.050514
C  3.917094 1.348368 0.923417
C  2.260189 -0.600903 1.042497
C  6.808562 0.039875 -0.438684
C  5.11048 -0.061153 -2.345303
C  4.623751 1.151711 2.283999
C  0.105637 0.317247 0.271439
C  -0.925429 1.398632 0.61921
C  -3.047382 0.484667 -0.186012
C  -4.064282 0.629848 0.790012
C  -3.125469 -0.594603 -1.096447
C  -5.139178 -0.276169 0.876446
C  -4.1952 -1.51269 -1.036327
C  -5.182571 -1.339115 -0.046671
H  2.964645 0.347152 -0.742246
H  4.913848 -1.386994 0.915422
H  3.915562 -1.929289 -0.44525
H  6.019718 -1.734919 -1.342318
H  4.599925 1.872965 0.229286
H  3.0502 2.022622 1.068012
H  1.879093 -1.502293 0.530417
H  2.563786 -0.847636 2.07289
H  7.640121 0.101258 -1.166045
H  7.192675 -0.463899 0.468362
H  6.533887 1.073133 -0.163118
H  4.262553 -0.616218 -2.788838
H  5.916834 -0.013778 -3.100573
H  4.77496 0.975685 -2.155466
H  4.94382 2.126705 2.694598
H  3.954138 0.688407 3.031818
H  5.523421 0.518352 2.19228
H  -1.285117 1.245099 1.654011
H  -0.440154 2.387336 0.568035
H  -2.322085 -0.699363 -1.829979
H  -5.91884 -0.148186 1.631061
H  -4.253012 -2.347563 -1.739559
