program: Orca
programVersion: 5.0.2
elementType: O O O C C C C C C C C C C C C C C C C C C C H H H H H H H H H H H H H H H H H H H H H H H H
charge: 0
multiplicity: 1
keywords: wb97x-d3
keywords: def2-TZVPP
keywords: def2/J RIJCOSX
keywords: DEFGRID2
keywords: scfconv7
keywords: smallprint printgap noloewdin
keywords: NOSOSCF
formula: C19H24O3
InChI: InChI=1/C19H24O3/c1-7-8-13-12(4)16(10-15(13)20)22-18(21)17-14(9-11(2)3)19(17,5)6/h1,9,14,16-17H,8,10H2,2-6H3
46 atoms
O  -0.441919 -0.325024 0.498205
O  -1.597421 -0.734774 2.367577
O  3.915139 -1.260709 -0.620118
C  -2.863352 1.221861 -0.499421
C  -3.009853 -0.172491 -1.001616
C  -2.765849 0.070057 0.489384
C  -1.664467 2.059315 -0.872853
C  -4.125399 2.044007 -0.369213
C  -2.018977 -0.811148 -1.904729
C  -1.559433 -0.361913 1.216538
C  -1.797635 -2.124932 -1.987526
C  0.796714 -0.76674 1.055578
C  -0.81574 -2.691365 -2.966791
C  -2.469869 -3.128404 -1.103035
C  1.589109 -1.546077 0.014833
C  1.658617 0.423114 1.393407
C  2.858721 0.347055 0.799915
C  2.938174 -0.867853 -0.019817
C  1.162577 1.492834 2.291993
C  3.993949 1.320651 0.912612
C  3.635416 2.644552 0.419083
C  3.313953 3.729946 0.015413
H  -4.035692 -0.484342 -1.183703
H  -3.643535 -0.054753 1.113131
H  -1.455607 2.798982 -0.097394
H  -0.754705 1.491764 -1.044394
H  -1.880643 2.608041 -1.792128
H  -4.988316 1.428876 -0.110548
H  -4.019785 2.809349 0.402474
H  -4.351547 2.550754 -1.30981
H  -1.467523 -0.152835 -2.570271
H  0.614164 -1.361214 1.953194
H  1.129965 -1.465829 -0.97395
H  1.68254 -2.607532 0.245874
H  -0.041603 -3.271711 -2.457251
H  -1.305504 -3.379515 -3.661245
H  -0.323839 -1.91598 -3.554124
H  -1.736273 -3.621241 -0.458044
H  -3.234532 -2.693895 -0.461404
H  -2.938234 -3.919664 -1.694113
H  0.483288 2.159633 1.754096
H  1.971011 2.103207 2.690993
H  0.601228 1.073947 3.127974
H  4.320545 1.402794 1.953326
H  4.85525 0.946959 0.353976
H  3.032883 4.695772 -0.339077
elementType: O C H
totalener: -964.16657433 hartree
nucrepener: 1853.66662126 hartree
electener: -2817.83319558 hartree
oneelecener: -4991.81694627 hartree
twoeener: 2173.98375069 hartree
cpcmener: -0.03150078 hartree
kineticenergy: 959.76941819 hartree
xcener: -94.697207877320 hartree
chargesum: 0.0000000
charge: -0.261073 -0.473558 -0.444847 0.149667 -0.020409 -0.162951 -0.313085 -0.266189 -0.243984 0.423076 -0.045427 0.197281 -0.240965 -0.263963 -0.122895 -0.000720 -0.091372 0.286440 -0.267546 -0.101036 -0.454860 0.037282 0.112288 0.093862 0.101841 0.092061 0.104638 0.086947 0.095732 0.093330 0.122898 0.109731 0.094026 0.106492 0.089964 0.108941 0.094862 0.097923 0.093417 0.105475 0.119078 0.109092 0.117534 0.133636 0.110483 0.286882
qa: -0.2611 -0.4736 -0.4448 0.1497 -0.0204 -0.1630 -0.3131 -0.2662 -0.2440 0.4231 -0.0454 0.1973 -0.2410 -0.2640 -0.1229 -0.0007 -0.0914 0.2864 -0.2675 -0.1010 -0.4549 0.0373 0.1123 0.0939 0.1018 0.0921 0.1046 0.0869 0.0957 0.0933 0.1229 0.1097 0.0940 0.1065 0.0900 0.1089 0.0949 0.0979 0.0934 0.1055 0.1191 0.1091 0.1175 0.1336 0.1105 0.2869
va: 2.0935 2.0297 2.0657 3.7061 3.7994 3.8746 3.9024 3.9030 3.8273 4.1186 3.7081 3.7820 3.9158 3.9459 3.8907 3.6744 3.5097 4.0788 3.9384 3.8953 3.8237 3.5435 1.0052 1.0280 0.9996 1.0103 1.0011 1.0056 1.0021 1.0024 1.0003 1.0340 1.0349 1.0216 0.9952 0.9982 1.0050 0.9970 1.0053 0.9997 0.9930 0.9983 1.0133 0.9875 1.0218 0.9472
dispcorr: -0.025437244 hartree
energy: -964.192011569988
dipole: -16.27640 14.90714 -1.36925 1.13834 -0.44162 0.69672 -7.75287 7.77525 0.02238
magnitude: 1.53648 au
magnitude: 3.90543 debye
