program: Orca
programVersion: 5.0.2
elementType: O O O C C C C C C C C C C C C C C C C C C C H H H H H H H H H H H H H H H H H H H H H H H H
charge: 0
multiplicity: 1
keywords: wb97x-d3
keywords: def2-TZVPP
keywords: def2/J RIJCOSX
keywords: DEFGRID2
keywords: scfconv7
keywords: smallprint printgap noloewdin
keywords: NOSOSCF
formula: C19H24O3
InChI: InChI=1/C19H24O3/c1-7-8-13-12(4)16(10-15(13)20)22-18(21)17-14(9-11(2)3)19(17,5)6/h1,9,14,16-17H,8,10H2,2-6H3
46 atoms
O  0.108114 -0.645606 0.901126
O  -1.267189 1.118049 0.830073
O  4.157187 -1.151003 3.035715
C  -3.405929 -1.000178 -0.006008
C  -2.835893 -0.538134 -1.310287
C  -1.897993 -0.971089 -0.180683
C  -4.108571 -0.034861 0.915663
C  -4.009933 -2.384382 0.026464
C  -2.931067 0.852033 -1.794657
C  -1.031154 -0.03394 0.553789
C  -3.266509 1.225143 -3.035688
C  1.08214 0.058633 1.673377
C  -3.337415 2.678771 -3.398878
C  -3.601779 0.297407 -4.164333
C  1.775368 -0.899082 2.63314
C  2.183169 0.594471 0.79057
C  3.390851 0.214509 1.232554
C  3.24852 -0.675079 2.3901
C  1.877429 1.452747 -0.377548
C  4.732449 0.57954 0.67291
C  5.121258 -0.304552 -0.419068
C  5.418175 -1.041676 -1.320424
H  -2.867447 -1.288039 -2.092661
H  -1.440328 -1.941647 -0.331997
H  -4.007072 -0.352452 1.955385
H  -3.755367 0.989814 0.846371
H  -5.174808 -0.027046 0.680532
H  -3.969779 -2.80579 1.033183
H  -5.058102 -2.352269 -0.278164
H  -3.491933 -3.072641 -0.642969
H  -2.72282 1.641141 -1.082393
H  0.608059 0.884171 2.209445
H  1.530317 -1.938874 2.403073
H  1.516718 -0.726704 3.678281
H  -3.066798 3.32718 -2.565294
H  -2.669614 2.907729 -4.233989
H  -4.343704 2.954324 -3.726519
H  -2.895694 0.425119 -4.989384
H  -3.604581 -0.756273 -3.892074
H  -4.589943 0.532311 -4.568882
H  1.299179 0.899661 -1.121531
H  2.777479 1.819637 -0.867124
H  1.271356 2.310925 -0.080896
H  4.732471 1.613074 0.319073
H  5.48574 0.526732 1.463344
H  5.686726 -1.688032 -2.125241
elementType: O C H
totalener: -964.17128230 hartree
nucrepener: 1755.67854083 hartree
electener: -2719.84982313 hartree
oneelecener: -4796.23475324 hartree
twoeener: 2076.38493011 hartree
cpcmener: -0.03166980 hartree
kineticenergy: 959.75796822 hartree
xcener: -94.694389589425 hartree
chargesum: 0.0000000
charge: -0.295339 -0.469743 -0.444621 0.105646 0.032968 -0.103054 -0.285751 -0.261144 -0.298488 0.394878 -0.048977 0.249063 -0.218475 -0.254403 -0.132157 -0.032330 -0.091426 0.288904 -0.242809 -0.113517 -0.444074 0.039839 0.115569 0.094933 0.102136 0.096462 0.096850 0.093601 0.094438 0.086784 0.123488 0.103154 0.100948 0.099350 0.088117 0.091775 0.092630 0.097246 0.088027 0.094693 0.112784 0.102020 0.117358 0.130135 0.115656 0.286856
qa: -0.2953 -0.4697 -0.4446 0.1056 0.0330 -0.1031 -0.2858 -0.2611 -0.2985 0.3949 -0.0490 0.2491 -0.2185 -0.2544 -0.1322 -0.0323 -0.0914 0.2889 -0.2428 -0.1135 -0.4441 0.0398 0.1156 0.0949 0.1021 0.0965 0.0968 0.0936 0.0944 0.0868 0.1235 0.1032 0.1009 0.0993 0.0881 0.0918 0.0926 0.0972 0.0880 0.0947 0.1128 0.1020 0.1174 0.1301 0.1157 0.2869
va: 2.1287 2.0243 2.0618 3.7116 3.7385 3.8931 3.9094 3.9085 3.8526 4.1028 3.7824 3.7712 3.9232 3.9392 3.8976 3.7529 3.5132 4.0701 3.9389 3.8890 3.8323 3.5444 1.0033 1.0301 0.9990 1.0135 1.0014 1.0022 1.0017 1.0056 1.0228 1.0305 1.0291 1.0241 1.0089 0.9961 0.9966 0.9966 1.0132 0.9974 1.0001 1.0046 1.0056 0.9904 1.0142 0.9472
dispcorr: -0.021122784 hartree
energy: -964.192405082400
dipole: -26.91366 25.22472 -1.68894 4.09006 -3.84885 0.24122 -16.57314 15.19218 -1.38096
magnitude: 2.19494 au
magnitude: 5.57909 debye
