program: Orca
programVersion: 5.0.2
elementType: O O O C C C C C C C C C C C C C C C C C C C H H H H H H H H H H H H H H H H H H H H H H H H
charge: 0
multiplicity: 1
keywords: wb97x-d3
keywords: def2-TZVPP
keywords: def2/J RIJCOSX
keywords: DEFGRID2
keywords: scfconv7
keywords: smallprint printgap noloewdin
keywords: NOSOSCF
formula: C19H24O3
InChI: InChI=1/C19H24O3/c1-7-8-13-12(4)16(10-15(13)20)22-18(21)17-14(9-11(2)3)19(17,5)6/h1,9,14,16-17H,8,10H2,2-6H3
46 atoms
O  -0.353605 -0.925041 1.192546
O  -1.676705 0.433605 2.384367
O  4.072264 -2.049448 1.628933
C  -3.470506 0.149114 -0.178936
C  -2.539475 -0.780983 -0.925615
C  -2.608318 -0.816769 0.578782
C  -3.156376 1.623407 -0.129622
C  -4.947968 -0.149912 -0.24006
C  -1.333153 -0.317283 -1.662056
C  -1.517563 -0.341124 1.474401
C  -1.342628 0.358878 -2.814215
C  0.819489 -0.600236 1.947324
C  -0.059327 0.73126 -3.493201
C  -2.590019 0.797431 -3.515668
C  1.699717 -1.833167 2.094283
C  1.662864 0.396397 1.189544
C  2.910095 -0.058102 0.998513
C  3.049667 -1.401715 1.572102
C  1.110015 1.704888 0.764973
C  4.049292 0.650638 0.328057
C  3.765788 0.981092 -1.062967
C  3.513794 1.266264 -2.203211
H  -3.040483 -1.626664 -1.392072
H  -3.1121 -1.677789 1.013352
H  -3.598532 2.129488 -0.989933
H  -3.577171 2.081472 0.767583
H  -2.088498 1.839667 -0.142977
H  -5.145118 -1.222629 -0.275737
H  -5.467694 0.25216 0.632505
H  -5.40004 0.298671 -1.127733
H  -0.36721 -0.606068 -1.261453
H  0.536975 -0.188797 2.918838
H  1.331672 -2.664833 1.488784
H  1.77303 -2.186991 3.123076
H  0.043301 1.817059 -3.573771
H  0.810635 0.350033 -2.957957
H  -0.024146 0.341544 -4.513989
H  -2.622517 0.388777 -4.529439
H  -3.500558 0.48975 -3.004069
H  -2.614296 1.884869 -3.625394
H  0.502264 2.147689 1.554827
H  0.462103 1.583148 -0.107788
H  1.890612 2.413777 0.494819
H  4.292632 1.569112 0.870628
H  4.945313 0.027172 0.374465
H  3.301802 1.513844 -3.218851
elementType: O C H
totalener: -964.16458608 hartree
nucrepener: 1844.17543239 hartree
electener: -2808.34001847 hartree
oneelecener: -4972.85499065 hartree
twoeener: 2164.51497219 hartree
cpcmener: -0.03083557 hartree
kineticenergy: 959.75895668 hartree
xcener: -94.693409632259 hartree
chargesum: 0.0000000
charge: -0.276440 -0.444121 -0.443883 0.079943 -0.009330 -0.065276 -0.286727 -0.272393 -0.306099 0.359972 0.004492 0.228697 -0.233091 -0.271265 -0.134512 -0.018114 -0.077609 0.280866 -0.273076 -0.095885 -0.452086 0.027662 0.107810 0.106716 0.096063 0.106225 0.087553 0.086541 0.096856 0.088762 0.123880 0.112195 0.102524 0.101300 0.097837 0.075528 0.101707 0.107163 0.091823 0.099971 0.121428 0.112639 0.115786 0.133362 0.110973 0.293635
qa: -0.2764 -0.4441 -0.4439 0.0799 -0.0093 -0.0653 -0.2867 -0.2724 -0.3061 0.3600 0.0045 0.2287 -0.2331 -0.2713 -0.1345 -0.0181 -0.0776 0.2809 -0.2731 -0.0959 -0.4521 0.0277 0.1078 0.1067 0.0961 0.1062 0.0876 0.0865 0.0969 0.0888 0.1239 0.1122 0.1025 0.1013 0.0978 0.0755 0.1017 0.1072 0.0918 0.1000 0.1214 0.1126 0.1158 0.1334 0.1110 0.2936
va: 2.1234 2.0519 2.0636 3.7213 3.7728 3.8360 3.9097 3.8983 3.8544 4.1790 3.6730 3.7623 3.9320 3.9371 3.9188 3.6453 3.5104 4.0627 3.9260 3.8924 3.8584 3.5617 1.0056 1.0127 1.0013 1.0095 0.9976 1.0050 1.0021 1.0032 1.0126 1.0279 1.0270 1.0236 0.9944 1.0066 0.9999 1.0011 1.0056 0.9959 1.0121 0.9906 0.9993 0.9883 1.0218 0.9424
dispcorr: -0.026171922 hartree
energy: -964.190758001843
dipole: -19.36078 17.93833 -1.42245 10.33446 -9.51358 0.82088 -16.49551 15.67573 -0.81978
magnitude: 1.83555 au
magnitude: 4.66561 debye
