program: Gaussian 09
title: 000062019
version: EM64L-G09RevD.01
frameworkgroup: C1[X(C8H13Cl2NO2)]
method: RPBEPBE
basis: SDD
operation: Freq
keyword: #p
keyword: freq=noraman
keyword: PBEPBE/SDD
title: #p freq=noraman PBEPBE/SDD
converged: NO YES NO NO
title: Mulliken charges:
elementType: Cl Cl O O N C C C C C C C C H H H H H H H H H H H H H
charge: 0.016849 0.070487 -0.285139 -0.241316 -0.215374 0.375912 -0.011793 -0.409371 -0.682579 -0.702326 -0.717495 0.376562 -0.723103 0.219953 0.236241 0.250630 0.229735 0.264915 0.215901 0.224325 0.257683 0.229914 0.227171 0.243971 0.211861 0.336386
chargesum: 0.00000
title: Mulliken charges with hydrogens summed into heavy atoms:
elementType: Cl Cl O O N C C C C C C C C
charge: 0.016849 0.070487 -0.285139 -0.241316 -0.215374 0.375912 0.208160 0.077501 0.027971 0.009596 -0.034493 0.376562 -0.386717
polarizability: 1.35222097e+02 -9.47230576e+00 1.20505469e+02 1.92094748e+00 -3.65065525e+00 9.58168316e+01
1716.lowfreq: -11.2240 -5.9655 0.0015 0.0016 0.0026 7.3343 38.1095 56.8885 103.4825
frequency: 37.8727 56.8846 103.3993 115.1115 115.4299 173.9311 176.8067 196.3237 201.4119 211.4786 226.4974 264.2629 274.2798 305.9526 325.2059 345.4235 394.1760 461.3222 486.3647 505.0759 567.8083 581.1946 663.9082 685.1842 740.9072 759.1872 790.2914 857.8854 897.5058 915.0225 928.8823 949.7629 959.4021 997.1515 1069.1707 1109.9008 1128.7993 1144.2026 1171.1230 1183.4030 1208.2463 1212.1120 1232.8111 1243.6452 1302.1735 1311.0600 1358.6964 1362.8839 1375.2302 1388.8243 1395.3765 1450.1097 1459.9461 1464.1121 1471.3705 1477.2536 1480.4658 1483.8415 1610.0077 2960.2526 2976.4763 2995.0133 2999.6409 3006.9829 3061.1302 3092.9432 3099.8510 3104.7487 3107.8411 3112.5281 3116.5606 3123.8291
redmass: 8.3541 5.9528 3.7551 4.9042 3.4070 1.3008 6.6813 2.2038 1.9178 1.6601 1.1001 3.2417 5.3876 7.2141 2.7708 3.7823 3.8543 2.6087 3.3642 3.4645 4.8403 5.9470 5.1196 6.7976 8.5583 7.2883 3.0134 3.4465 3.2504 1.9888 1.5312 2.0166 1.7565 1.3046 2.3566 2.8702 2.0724 2.1187 1.6195 1.4649 2.4411 1.3507 1.3977 2.6409 1.3853 1.2246 4.9995 1.5495 1.2677 1.2297 1.2696 1.0464 1.0518 1.0526 1.0691 1.0617 1.0645 1.0550 9.1869 1.0824 1.0643 1.0363 1.0351 1.0355 1.1019 1.0994 1.1003 1.1002 1.1001 1.1004 1.0886 1.1007
irintensity: 0.7828 0.4901 2.9359 2.0807 2.7633 0.7300 3.8294 0.2071 0.3658 0.0665 0.2762 0.2433 3.8242 1.3419 1.2133 2.7131 0.9802 1.0448 4.9712 6.6645 25.2145 52.0936 21.3076 36.4745 25.7388 47.8410 8.7737 24.3440 9.9827 19.7552 5.1808 11.7268 11.2305 0.7581 48.9558 50.4362 29.1916 2.6483 13.4965 40.6075 75.9145 23.6984 35.8056 51.3609 2.0631 1.5741 129.8532 5.9472 41.5915 44.0328 27.9037 1.4571 6.3412 6.5724 21.0097 11.0387 8.0596 10.6062 224.3238 27.3085 44.0190 21.1535 16.4762 10.8695 9.2991 22.2121 21.0271 23.7447 16.9543 15.2706 5.5202 7.1018
temp: 298.150 k
press: 1.00000 atm
elementType: 17 17 8 8 7 6 6 6 6 6 6 6 6 1 1 1 1 1 1 1 1 1 1 1 1 1
symmnumber: 1
zpe: 533079.1 jmol-1
zpe.correction: 0.203039 hartree
zpe.thermalcorrener: 0.217700 hartree
zpe.thermalcorrenthalpy: 0.218644 hartree
zpe.thermalcorrgfe: 0.161037 hartree
zpe.sumelectzpe: -1436.936057 hartree
zpe.sumelectthermal: -1436.921396 hartree
zpe.sumelectthermalent: -1436.920452 hartree
zpe.sumelectthermalfe: -1436.978060 hartree
dipole: 3.3402 -3.3004 -1.2012
dipole: 4.8469
quadrupole: -101.2431 -90.5816 -89.6778
quadrupole: 0.2283 3.5451 1.3075
quadrupole: -7.4089 3.2525 4.1564 0.2283 3.5451 1.3075
hfenergy: -1437.1390966 hartree
pointgroup: C01 [X(C8H13Cl2N1O2)]
dipole: -1.4144871 -1.2510194 0.2655885 debye
dipolederiv: -0.2752578 0.0581346 0.0186907 0.0596108 -0.3096385 -0.2271796 -0.0082325 -0.2684937 -0.5175429 -0.5220177 -0.1056586 -0.2618908 -0.0965232 -0.1191491 -0.1041511 -0.1761838 -0.0829682 -0.2274494 -0.6489907 -0.2003904 0.0041249 -0.1328331 -0.9430025 0.0266009 -0.0855076 0.0189443 -0.4267008 -0.7477646 -0.0761469 0.031748 -0.3482365 -0.8629899 0.0606143 0.0656775 0.1040942 -0.3249207 -1.3272553 -0.2787057 0.068862 0.0735082 -0.6121782 0.0903594 -0.0698505 0.0447902 -0.3607019 0.8817081 0.106759 0.032765 -0.246545 0.8117228 -0.0511029 0.0792439 -0.0818221 0.6463748 0.4307187 -0.0256173 0.0126543 0.1259173 0.6501308 0.0330204 0.1274122 0.0787792 0.3570296 -0.0519959 0.1628479 -0.0805673 0.1330453 0.3102197 -0.0920224 -0.0876327 -0.0829449 0.2529359 -0.1273693 -0.0411234 -0.0146108 0.0236166 -0.077731 0.0462156 0.0439949 0.124473 -0.223069 -0.0943985 -0.0156619 0.018702 -0.0063778 -0.1392633 -0.0650371 -0.0276175 -0.1096388 -0.1033438 -0.0576813 -0.0872789 0.030344 -0.0601388 -0.0345812 0.0395488 0.0213694 0.047947 0.0392024 1.4428807 0.2246752 -0.1410686 0.1663641 0.9235595 -0.1090357 -0.12496 -0.1421114 0.0789197 0.7521545 0.1591079 0.2597353 0.2314002 0.2991779 0.3699848 0.2523364 0.363683 0.8591756 0.0108669 0.0286842 0.028901 -0.0083325 -0.0292097 0.0050428 -0.0211106 -0.0616436 -0.1914445 0.0486987 -0.0289842 0.005252 -0.0662239 -0.0256442 0.0520338 -0.0040096 0.1161237 -0.1168563 0.0846486 0.0782479 0.0341777 0.030486 -0.0457745 -0.0211288 0.0376797 -0.0588059 0.0296797 -0.0383954 0.1308656 -0.0288568 0.1255572 0.0114022 0.0294376 -0.025529 0.0130654 0.0842505 0.0148705 -0.0994015 0.0537437 -0.0755803 0.0635055 0.0136087 0.0301648 -0.0041058 0.1065058 0.1043411 0.0015608 -0.0168148 -0.0217465 -0.0378767 -0.1340659 -0.0017447 -0.0926391 -0.0286237 0.1120093 0.0063729 -0.0062719 -0.0091071 0.0440647 0.0979382 -0.0069089 0.0534284 -0.104149 0.0308497 -0.1195112 -0.0067066 -0.0779903 0.0659014 0.0089674 0.0128118 0.021896 0.1004434 -0.0490134 0.134388 -0.0111274 0.1189567 0.0320442 -0.0008956 -0.0266482 0.0056358 0.0855753 0.0868255 -0.0197705 -0.0394653 -0.0060312 0.0926694 -0.0443701 0.0173925 0.010473 -0.1251265 -0.1166891 -0.0032787 -0.0534764 0.0553043 0.1003505 0.0232923 -0.0632089 0.0296584 0.072729 0.0834812 0.0654438 0.0287414 0.0100566 -0.1308314 -0.0395901 0.030688 -0.0538421 0.0808466 -0.0272246 -0.0555587 0.0324144 0.0018427 -0.0368782 -0.0080855 0.0103733 0.006024 -0.0437397 unknown
polarizability: 136.5315108|7.6915813|117.4714668|3.8675231|6.9988827|97.5414203 unknown
InChI: InChI=1S/C8H13Cl2NO2/c1-5-4-11(7(12)6(9)10)8(2,3)13-5/h5-6H,4H2,1-3H3
charge 0 multiplicity 1
26 atoms
Cl 2.521086 -1.611638 -1.380748
Cl 3.877077 -0.15772 0.952349
O  -2.374535 0.240016 0.198499
O  1.672152 1.611063 -0.10208
N  -0.049659 0.053579 0.142086
C  -1.170813 1.069719 -0.033356
C  -2.050596 -1.148866 -0.20627
C  -0.594545 -1.318557 0.293708
C  -1.158041 1.642165 -1.463078
C  -1.15459 2.149877 1.052273
C  -3.074071 -2.08635 0.423985
C  1.276201 0.425323 0.087745
C  2.268268 -0.746268 0.282543
H  -2.073573 -1.226105 -1.314016
H  -0.590977 -1.636058 1.355384
H  -0.035888 -2.049704 -0.315627
H  -2.011409 2.33039 -1.584728
H  -0.220397 2.194168 -1.640241
H  -1.244146 0.83714 -2.213318
H  -1.16317 1.686056 2.052514
H  -0.258695 2.781635 0.947279
H  -2.056898 2.77627 0.948906
H  -3.068959 -1.980373 1.522737
H  -4.086343 -1.845737 0.058103
H  -2.853046 -3.137479 0.16442
H  1.913767 -1.533147 0.960333
