program: Orca
programVersion: 5.0.2
elementType: O O O C C C C C C C C C C C C C C C C C C C H H H H H H H H H H H H H H H H H H H H H H H H
charge: 0
multiplicity: 1
keywords: wb97x-d3
keywords: def2-TZVPP
keywords: def2/J RIJCOSX
keywords: DEFGRID2
keywords: scfconv7
keywords: smallprint printgap noloewdin
keywords: NOSOSCF
formula: C19H24O3
InChI: InChI=1/C19H24O3/c1-7-8-13-12(4)16(10-15(13)20)22-18(21)17-14(9-11(2)3)19(17,5)6/h1,9,14,16-17H,8,10H2,2-6H3
46 atoms
O  -0.587377 0.064977 1.092852
O  -1.566882 -0.908817 2.845766
O  3.021657 -2.047846 0.031994
C  -3.266315 0.36983 -0.213457
C  -2.814559 -1.009574 -0.58051
C  -2.844561 -0.589078 0.882974
C  -2.44595 1.584826 -0.579242
C  -4.753518 0.639531 -0.263026
C  -1.539653 -1.314192 -1.281841
C  -1.62727 -0.495529 1.71846
C  -1.251021 -0.984769 -2.540588
C  0.682008 0.035701 1.745909
C  0.058227 -1.37125 -3.160741
C  -2.179712 -0.222438 -3.434869
C  1.34821 -1.332616 1.648874
C  1.565101 0.953442 0.9340
C  2.508627 0.27436 0.272997
C  2.390806 -1.168972 0.560673
C  1.303999 2.414404 0.917732
C  3.546112 0.797734 -0.675447
C  4.414842 1.803185 -0.078072
C  5.121313 2.636228 0.418687
H  -3.618136 -1.702954 -0.82137
H  -3.658008 -1.007076 1.464187
H  -1.408713 1.35271 -0.799088
H  -2.873136 2.052345 -1.468112
H  -2.474479 2.327048 0.220875
H  -5.056775 0.939937 -1.268135
H  -5.339776 -0.238843 0.009614
H  -5.02731 1.445056 0.4205
H  -0.810049 -1.903999 -0.736569
H  0.575059 0.380285 2.777904
H  0.659512 -2.149761 1.437082
H  1.85493 -1.586973 2.582442
H  0.594941 -0.488644 -3.518489
H  0.708179 -1.896047 -2.461169
H  -0.091426 -2.015862 -4.030404
H  -3.143564 -0.018748 -2.972877
H  -1.739551 0.732131 -3.733999
H  -2.364124 -0.780144 -4.356452
H  0.262018 2.616649 0.664917
H  1.943066 2.94579 0.216683
H  1.477552 2.838367 1.909776
H  4.150616 -0.041293 -1.029245
H  3.064402 1.218605 -1.563357
H  5.756028 3.364987 0.861809
totalener: -964.14091416 hartree
nucrepener: 1862.95056186 hartree
electener: -2827.09147603 hartree
oneelecener: -5010.30781430 hartree
twoeener: 2183.21633828 hartree
kineticenergy: 959.82794184 hartree
xcener: -94.698873824911 hartree
chargesum: 0.0000000
charge: -0.264723 -0.355155 -0.331778 0.075041 -0.017646 -0.077659 -0.278885 -0.244962 -0.196086 0.291434 -0.015552 0.220877 -0.222024 -0.247355 -0.161940 -0.034676 -0.047948 0.224762 -0.240425 -0.174251 -0.427025 0.111442 0.099796 0.088923 0.090026 0.087827 0.108838 0.081384 0.075537 0.096177 0.083602 0.095750 0.094531 0.094968 0.077619 0.088144 0.093444 0.082008 0.091502 0.099084 0.103445 0.092813 0.104443 0.120415 0.117956 0.246303
qa: -0.2647 -0.3552 -0.3318 0.0750 -0.0176 -0.0777 -0.2789 -0.2450 -0.1961 0.2914 -0.0156 0.2209 -0.2220 -0.2474 -0.1619 -0.0347 -0.0479 0.2248 -0.2404 -0.1743 -0.4270 0.1114 0.0998 0.0889 0.0900 0.0878 0.1088 0.0814 0.0755 0.0962 0.0836 0.0957 0.0945 0.0950 0.0776 0.0881 0.0934 0.0820 0.0915 0.0991 0.1034 0.0928 0.1044 0.1204 0.1180 0.2463
va: 2.0794 2.1510 2.1566 3.6679 3.8068 3.8466 3.8950 3.9202 3.9048 4.2679 3.6957 3.7554 3.9360 3.9389 3.9013 3.6839 3.4896 4.0546 3.9491 3.9232 3.8892 3.5504 1.0073 1.0269 1.0037 1.0049 1.0013 1.0067 1.0091 1.0024 1.0205 1.0203 1.0310 1.0237 0.9985 1.0152 1.0009 1.0086 0.9974 1.0043 1.0046 1.0090 1.0009 1.0185 0.9859 0.9722
dispcorr: -0.026021621 hartree
energy: -964.166935784141
dipole: -15.50634 14.72225 -0.78409 7.93743 -6.59158 1.34585 -15.33430 14.70241 -0.63189
magnitude: 1.68089 au
magnitude: 4.27249 debye
