program: Orca
programVersion: 5.0.2
elementType: O O O C C C C C C C C C C C C C C C C C C C H H H H H H H H H H H H H H H H H H H H H H H H
charge: 0
multiplicity: 1
keywords: wb97x-d3
keywords: def2-TZVPP
keywords: def2/J RIJCOSX
keywords: DEFGRID2
keywords: scfconv7
keywords: smallprint printgap noloewdin
keywords: NOSOSCF
formula: C19H24O3
InChI: InChI=1/C19H24O3/c1-7-8-13-12(4)16(10-15(13)20)22-18(21)17-14(9-11(2)3)19(17,5)6/h1,9,14,16-17H,8,10H2,2-6H3
46 atoms
O  0.313164 -1.704351 -0.48358
O  0.255999 0.491961 -0.055322
O  3.991327 0.66733 -2.204647
C  -2.410983 -0.40995 1.399494
C  -2.714502 0.348476 0.142606
C  -1.743488 -0.816005 0.094653
C  -1.615665 0.282648 2.478762
C  -3.41577 -1.392058 1.951325
C  -3.997854 0.231398 -0.576322
C  -0.31278 -0.571658 -0.147507
C  -4.691124 1.224659 -1.143564
C  1.716557 -1.680626 -0.752853
C  -5.978319 0.944592 -1.860051
C  -4.28997 2.667924 -1.138194
C  2.144433 -0.89255 -1.987189
C  2.545502 -1.127526 0.378334
C  3.470774 -0.266452 -0.06943
C  3.305612 -0.055489 -1.507616
C  2.321766 -1.571094 1.773287
C  4.497497 0.464426 0.74102
C  3.910048 1.615727 1.416718
C  3.397956 2.549263 1.974927
H  -2.234743 1.320013 0.094911
H  -2.119097 -1.738978 -0.333023
H  -2.298962 0.74212 3.195402
H  -0.968507 1.070585 2.099553
H  -0.997117 -0.430268 3.028259
H  -3.931426 -1.955207 1.175022
H  -4.170253 -0.873075 2.545619
H  -2.920382 -2.112418 2.604664
H  -4.404631 -0.77236 -0.658817
H  1.959947 -2.738229 -0.871353
H  1.358102 -0.248975 -2.384458
H  2.461294 -1.544167 -2.802471
H  -6.229732 -0.115822 -1.858058
H  -6.808246 1.489907 -1.403222
H  -5.927386 1.277578 -2.899934
H  -5.078275 3.280638 -0.69415
H  -3.370395 2.87028 -0.593438
H  -4.158876 3.032859 -2.159889
H  1.436082 -1.085666 2.192492
H  3.162608 -1.326871 2.420078
H  2.145452 -2.646454 1.819136
H  4.940979 -0.200477 1.485948
H  5.316459 0.797113 0.099373
H  2.943959 3.380124 2.466428
elementType: O C H
totalener: -964.16209790 hartree
nucrepener: 1792.86864225 hartree
electener: -2757.03074015 hartree
oneelecener: -4871.30225840 hartree
twoeener: 2114.27151825 hartree
cpcmener: -0.04493438 hartree
kineticenergy: 959.77165721 hartree
xcener: -94.700815703912 hartree
chargesum: 0.0000000
charge: -0.299111 -0.491156 -0.485002 0.112610 0.033625 -0.099045 -0.286985 -0.275336 -0.284109 0.405546 -0.053193 0.284680 -0.218075 -0.253257 -0.148777 0.001371 -0.140554 0.304692 -0.261802 -0.105219 -0.439871 0.017209 0.094231 0.089427 0.103850 0.094276 0.097294 0.089972 0.098456 0.098298 0.121207 0.121913 0.114287 0.112691 0.088828 0.093715 0.093038 0.096220 0.090462 0.097203 0.119736 0.109109 0.119806 0.133959 0.112776 0.291007
qa: -0.2991 -0.4912 -0.4850 0.1126 0.0336 -0.0990 -0.2870 -0.2753 -0.2841 0.4055 -0.0532 0.2847 -0.2181 -0.2533 -0.1488 0.0014 -0.1406 0.3047 -0.2618 -0.1052 -0.4399 0.0172 0.0942 0.0894 0.1038 0.0943 0.0973 0.0900 0.0985 0.0983 0.1212 0.1219 0.1143 0.1127 0.0888 0.0937 0.0930 0.0962 0.0905 0.0972 0.1197 0.1091 0.1198 0.1340 0.1128 0.2910
va: 2.1328 2.0152 2.0139 3.6737 3.7861 3.8269 3.9061 3.9079 3.8735 4.1658 3.7627 3.7797 3.9193 3.9403 3.8691 3.6661 3.5327 4.0481 3.9433 3.8886 3.8057 3.5664 1.0310 1.0376 1.0018 1.0158 0.9997 1.0063 1.0015 1.0012 1.0107 0.9918 1.0248 1.0212 1.0088 0.9962 0.9963 0.9970 1.0106 0.9965 0.9943 1.0010 1.0013 0.9918 1.0163 0.9448
dispcorr: -0.022440412 hartree
energy: -964.184538310045
dipole: -27.71210 25.99308 -1.71902 0.52233 -2.91150 -2.38917 7.78763 -6.40719 1.38044
magnitude: 3.25097 au
magnitude: 8.26330 debye
