program: Orca
programVersion: 5.0.2
elementType: O O O C C C C C C C C C C C C C C C C C C C H H H H H H H H H H H H H H H H H H H H H H H H
charge: 0
multiplicity: 1
keywords: wb97x-d3
keywords: def2-TZVPP
keywords: def2/J RIJCOSX
keywords: DEFGRID2
keywords: scfconv7
keywords: smallprint printgap noloewdin
keywords: NOSOSCF
formula: C19H24O3
InChI: InChI=1/C19H24O3/c1-7-8-13-12(4)16(10-15(13)20)22-18(21)17-14(9-11(2)3)19(17,5)6/h1,9,14,16-17H,8,10H2,2-6H3
46 atoms
O  0.332255 -1.066417 -0.098916
O  -0.765402 -1.183664 1.851288
O  4.827915 -1.335615 -1.02018
C  -3.244499 -1.731152 0.009962
C  -3.225127 -0.299723 0.410214
C  -1.973696 -0.916617 -0.196907
C  -3.312624 -2.800058 1.073173
C  -3.958156 -2.119058 -1.26238
C  -3.965129 0.75694 -0.323394
C  -0.77953 -1.07523 0.645474
C  -3.534142 2.015969 -0.441396
C  1.611511 -1.182023 0.532394
C  -4.347435 3.064902 -1.13216
C  -2.217136 2.460482 0.128788
C  2.56984 -1.944675 -0.37042
C  2.238152 0.179002 0.706135
C  3.456107 0.235199 0.146638
C  3.773657 -1.044496 -0.49016
C  1.542065 1.260288 1.441375
C  4.39841 1.401035 0.140713
C  3.888617 2.51611 -0.647151
C  3.450725 3.440347 -1.278914
H  -3.136347 -0.13363 1.481864
H  -1.76635 -0.655776 -1.228193
H  -2.762187 -3.692516 0.769795
H  -4.353534 -3.093812 1.223246
H  -2.927574 -2.476261 2.037248
H  -3.854121 -1.369807 -2.047152
H  -5.024734 -2.258913 -1.0748
H  -3.566026 -3.060708 -1.650519
H  -4.928951 0.488731 -0.746521
H  1.5084 -1.669243 1.503903
H  2.145487 -2.105412 -1.36411
H  2.847364 -2.920991 0.026686
H  -4.565828 3.896232 -0.456562
H  -3.799278 3.492498 -1.975498
H  -5.294337 2.674828 -1.504625
H  -1.410762 1.766657 -0.115593
H  -1.930541 3.44409 -0.243467
H  -2.255038 2.527774 1.219037
H  0.697872 1.638919 0.859398
H  2.199209 2.100382 1.656952
H  1.135927 0.889295 2.383036
H  4.584128 1.74165 1.162356
H  5.367205 1.092396 -0.257342
H  3.064819 4.259798 -1.842086
elementType: O C H
totalener: -964.16090365 hartree
nucrepener: 1784.07317325 hartree
electener: -2748.23407690 hartree
oneelecener: -4852.72008127 hartree
twoeener: 2104.48600437 hartree
cpcmener: -0.03710552 hartree
kineticenergy: 959.77067086 hartree
xcener: -94.698136327506 hartree
chargesum: -0.0000000
charge: -0.296478 -0.499136 -0.481857 0.154121 -0.004024 -0.112192 -0.281445 -0.289344 -0.317269 0.394113 0.020177 0.248531 -0.228507 -0.293360 -0.134507 -0.004274 -0.100616 0.310780 -0.277942 -0.091302 -0.465729 0.039261 0.102545 0.099585 0.101712 0.096276 0.090783 0.093373 0.100128 0.098179 0.125244 0.106726 0.104158 0.102347 0.101011 0.096306 0.086671 0.099797 0.103081 0.109353 0.127489 0.109180 0.119720 0.135221 0.109203 0.292909
qa: -0.2965 -0.4991 -0.4819 0.1541 -0.0040 -0.1122 -0.2814 -0.2893 -0.3173 0.3941 0.0202 0.2485 -0.2285 -0.2934 -0.1345 -0.0043 -0.1006 0.3108 -0.2779 -0.0913 -0.4657 0.0393 0.1025 0.0996 0.1017 0.0963 0.0908 0.0934 0.1001 0.0982 0.1252 0.1067 0.1042 0.1023 0.1010 0.0963 0.0867 0.0998 0.1031 0.1094 0.1275 0.1092 0.1197 0.1352 0.1092 0.2929
va: 2.1176 1.9970 2.0179 3.7042 3.8018 3.8415 3.8904 3.9115 3.8760 4.1301 3.6496 3.7681 3.9292 3.9483 3.9168 3.6955 3.5391 4.0221 3.9326 3.8780 3.8254 3.5312 1.0256 1.0305 0.9985 1.0008 1.0186 1.0021 0.9994 1.0027 1.0032 1.0296 1.0283 1.0231 0.9929 0.9942 1.0075 0.9950 1.0066 0.9930 0.9882 1.0014 1.0103 0.9890 1.0216 0.9433
dispcorr: -0.022767170 hartree
energy: -964.183670816775
dipole: -26.11357 24.26034 -1.85323 6.12300 -5.39777 0.72523 -0.20765 0.50637 0.29872
magnitude: 2.01238 au
magnitude: 5.11505 debye
