program: Orca
programVersion: 5.0.2
elementType: O O O C C C C C C C C C C C C C C C C C C C H H H H H H H H H H H H H H H H H H H H H H H H
charge: 0
multiplicity: 1
keywords: wb97x-d3
keywords: def2-TZVPP
keywords: def2/J RIJCOSX
keywords: DEFGRID2
keywords: scfconv7
keywords: smallprint printgap noloewdin
keywords: NOSOSCF
formula: C19H24O3
InChI: InChI=1/C19H24O3/c1-7-8-13-12(4)16(10-15(13)20)22-18(21)17-14(9-11(2)3)19(17,5)6/h1,9,14,16-17H,8,10H2,2-6H3
46 atoms
O  0.261438 -1.081103 -0.154374
O  -0.677638 -0.75431 1.855516
O  4.816311 -1.392987 -1.051713
C  -3.253082 -1.808902 0.365484
C  -3.284973 -0.328948 0.503928
C  -2.05021 -0.992186 -0.088838
C  -3.174264 -2.663181 1.60642
C  -4.034474 -2.45868 -0.750716
C  -4.133685 0.547877 -0.34184
C  -0.789281 -0.933763 0.663536
C  -3.850218 1.821062 -0.629903
C  1.581634 -0.916962 0.364902
C  -4.767142 2.657385 -1.467152
C  -2.610186 2.515167 -0.158445
C  2.555088 -1.8738 -0.307283
C  2.108744 0.459903 0.047064
C  3.335002 0.398046 -0.493667
C  3.730936 -1.001221 -0.67075
C  1.329206 1.673903 0.380423
C  4.231111 1.545346 -0.855905
C  4.712443 2.257151 0.322077
C  5.090751 2.839169 1.304004
H  -3.127479 0.027148 1.518939
H  -1.934549 -0.916389 -1.163734
H  -2.704273 -2.15787 2.446912
H  -2.623415 -3.585359 1.412766
H  -4.18201 -2.943403 1.918434
H  -5.072166 -2.615475 -0.449791
H  -3.61113 -3.434637 -0.993781
H  -4.038079 -1.863821 -1.663854
H  -5.055454 0.121827 -0.727392
H  1.580273 -1.061834 1.447261
H  2.130605 -2.28827 -1.225297
H  2.854817 -2.708879 0.325009
H  -5.651101 2.10605 -1.786835
H  -5.099383 3.542483 -0.918773
H  -4.253974 3.023198 -2.360138
H  -2.01452 2.856669 -1.009157
H  -2.864678 3.410343 0.414717
H  -1.974353 1.890133 0.466116
H  0.363184 1.666651 -0.12962
H  1.846686 2.588707 0.099998
H  1.119854 1.711355 1.451562
H  5.086054 1.179539 -1.428662
H  3.703757 2.24498 -1.509212
H  5.424286 3.357024 2.174911
elementType: O C H
totalener: -964.16228791 hartree
nucrepener: 1771.26663599 hartree
electener: -2735.42892390 hartree
oneelecener: -4826.95926190 hartree
twoeener: 2091.53033800 hartree
cpcmener: -0.03769691 hartree
kineticenergy: 959.76971275 hartree
xcener: -94.698848321841 hartree
chargesum: -0.0000000
charge: -0.296371 -0.496803 -0.481837 0.156093 -0.018716 -0.093727 -0.275133 -0.290724 -0.305326 0.384092 -0.001164 0.251676 -0.230226 -0.246444 -0.137207 -0.010256 -0.095654 0.315931 -0.256524 -0.100943 -0.463638 0.042539 0.103250 0.092017 0.090414 0.100476 0.095987 0.100770 0.098619 0.093350 0.124696 0.107870 0.105299 0.099646 0.090477 0.096158 0.095757 0.101833 0.103677 0.070914 0.115102 0.102933 0.121850 0.110648 0.136191 0.292429
qa: -0.2964 -0.4968 -0.4818 0.1561 -0.0187 -0.0937 -0.2751 -0.2907 -0.3053 0.3841 -0.0012 0.2517 -0.2302 -0.2464 -0.1372 -0.0103 -0.0957 0.3159 -0.2565 -0.1009 -0.4636 0.0425 0.1033 0.0920 0.0904 0.1005 0.0960 0.1008 0.0986 0.0934 0.1247 0.1079 0.1053 0.0996 0.0905 0.0962 0.0958 0.1018 0.1037 0.0709 0.1151 0.1029 0.1219 0.1106 0.1362 0.2924
va: 2.1207 1.9973 2.0158 3.7041 3.8114 3.8083 3.8910 3.9119 3.8968 4.1533 3.6893 3.7618 3.9285 3.9458 3.9260 3.7087 3.5367 4.0273 3.9293 3.8757 3.8205 3.5280 1.0270 1.0342 1.0178 0.9993 1.0008 0.9989 1.0027 1.0009 1.0037 1.0321 1.0261 1.0247 1.0059 0.9959 0.9962 0.9957 1.0005 1.0133 1.0034 1.0048 1.0018 1.0198 0.9884 0.9434
dispcorr: -0.022485605 hartree
energy: -964.184773512089
dipole: -28.22777 25.91224 -2.31553 5.76443 -4.90378 0.86065 -2.04156 1.46222 -0.57933
magnitude: 2.53733 au
magnitude: 6.44938 debye
