program: Orca
programVersion: 5.0.2
elementType: O O O C C C C C C C C C C C C C C C C C C C H H H H H H H H H H H H H H H H H H H H H H H H
charge: 0
multiplicity: 1
keywords: wb97x-d3
keywords: def2-TZVPP
keywords: def2/J RIJCOSX
keywords: DEFGRID2
keywords: scfconv7
keywords: smallprint printgap noloewdin
keywords: NOSOSCF
formula: C19H24O3
InChI: InChI=1/C19H24O3/c1-7-8-13-12(4)16(10-15(13)20)22-18(21)17-14(9-11(2)3)19(17,5)6/h1,9,14,16-17H,8,10H2,2-6H3
46 atoms
O  0.491482 -0.995735 -0.11942
O  -0.704602 -0.98524 1.777066
O  4.997881 -1.497709 -0.842028
C  -3.077259 -1.567558 -0.203478
C  -3.076461 -0.118173 0.169229
C  -1.796325 -0.761079 -0.342077
C  -3.229121 -2.591639 0.894682
C  -3.711174 -2.00803 -1.501324
C  -3.726004 0.921525 -0.650977
C  -0.652719 -0.926286 0.569429
C  -4.414932 1.977915 -0.205482
C  1.733099 -1.146413 0.575993
C  -5.014125 2.958105 -1.169467
C  -4.66003 2.300694 1.236603
C  2.692567 -1.9872 -0.254722
C  2.416435 0.190322 0.731095
C  3.662862 0.163514 0.236676
C  3.941119 -1.146582 -0.355706
C  1.734273 1.330245 1.38486
C  4.668429 1.274443 0.23415
C  4.425866 2.217261 -0.851598
C  4.19821 2.98694 -1.746954
H  -3.07743 0.056616 1.239556
H  -1.521892 -0.525478 -1.364127
H  -2.898064 -2.235527 1.86721
H  -2.676233 -3.503229 0.659775
H  -4.281746 -2.863983 0.99078
H  -4.79372 -2.090864 -1.387061
H  -3.333879 -2.989972 -1.791876
H  -3.513776 -1.325582 -2.326605
H  -3.620473 0.812288 -1.726374
H  1.561163 -1.591157 1.558145
H  2.301491 -2.168654 -1.258376
H  2.908609 -2.957901 0.191705
H  -4.637606 3.967715 -0.985468
H  -4.798628 2.701869 -2.206521
H  -6.099777 3.008561 -1.052503
H  -4.228192 3.272918 1.488362
H  -5.732412 2.382428 1.431177
H  -4.253849 1.568071 1.931154
H  2.389881 2.191096 1.499273
H  1.362701 1.043525 2.370062
H  0.867902 1.648568 0.800216
H  4.646888 1.810408 1.185549
H  5.675211 0.861559 0.136907
H  4.00482 3.670046 -2.54297
elementType: O C H
totalener: -964.16431222 hartree
nucrepener: 1745.41539886 hartree
electener: -2709.57971107 hartree
oneelecener: -4775.55581373 hartree
twoeener: 2065.97610265 hartree
cpcmener: -0.03902298 hartree
kineticenergy: 959.76203793 hartree
xcener: -94.696869818390 hartree
chargesum: 0.0000000
charge: -0.295812 -0.497743 -0.480720 0.101296 0.039746 -0.093214 -0.277320 -0.274900 -0.282666 0.409567 -0.052101 0.254481 -0.217840 -0.252648 -0.136334 -0.023714 -0.101098 0.317001 -0.245346 -0.102074 -0.454017 0.034333 0.095943 0.088616 0.090153 0.100220 0.097587 0.098354 0.097230 0.090351 0.120731 0.107142 0.103867 0.102965 0.093418 0.088725 0.093990 0.097647 0.095675 0.090336 0.103222 0.119011 0.116070 0.133954 0.113447 0.292468
qa: -0.2958 -0.4977 -0.4807 0.1013 0.0397 -0.0932 -0.2773 -0.2749 -0.2827 0.4096 -0.0521 0.2545 -0.2178 -0.2526 -0.1363 -0.0237 -0.1011 0.3170 -0.2453 -0.1021 -0.4540 0.0343 0.0959 0.0886 0.0902 0.1002 0.0976 0.0984 0.0972 0.0904 0.1207 0.1071 0.1039 0.1030 0.0934 0.0887 0.0940 0.0976 0.0957 0.0903 0.1032 0.1190 0.1161 0.1340 0.1134 0.2925
va: 2.1284 2.0012 2.0180 3.6924 3.7741 3.8449 3.9050 3.9125 3.8784 4.1491 3.7630 3.7464 3.9187 3.9398 3.9153 3.7547 3.5378 4.0305 3.9350 3.8808 3.8297 3.5378 1.0296 1.0374 1.0189 0.9989 0.9998 1.0011 1.0016 1.0065 1.0111 1.0300 1.0286 1.0227 0.9962 1.0089 0.9960 0.9964 0.9971 1.0105 1.0040 1.0055 0.9986 0.9897 1.0167 0.9435
dispcorr: -0.020791474 hartree
energy: -964.185103693040
dipole: -31.28130 29.22575 -2.05555 6.27479 -5.57246 0.70233 0.76940 -0.42380 0.34559
magnitude: 2.19954 au
magnitude: 5.59079 debye
