program: Orca
programVersion: 5.0.2
elementType: O O O C C C C C C C C C C C C C C C C C C C H H H H H H H H H H H H H H H H H H H H H H H H
charge: 0
multiplicity: 1
keywords: wb97x-d3
keywords: def2-TZVPP
keywords: def2/J RIJCOSX
keywords: DEFGRID2
keywords: scfconv7
keywords: smallprint printgap noloewdin
keywords: NOSOSCF
formula: C19H24O3
InChI: InChI=1/C19H24O3/c1-7-8-13-12(4)16(10-15(13)20)22-18(21)17-14(9-11(2)3)19(17,5)6/h1,9,14,16-17H,8,10H2,2-6H3
46 atoms
O  0.151753 -0.874251 -0.2480
O  -0.398527 -2.794381 0.759707
O  3.945993 0.470147 -2.422106
C  -2.274952 0.17279 1.422072
C  -2.540133 0.158481 -0.05609
C  -2.027691 -1.094498 0.621085
C  -1.122918 1.001092 1.934879
C  -3.436018 0.122064 2.385865
C  -3.910073 0.157736 -0.612341
C  -0.689891 -1.679136 0.396995
C  -4.410434 1.028686 -1.49466
C  1.473267 -1.325475 -0.562378
C  -5.823173 0.901108 -1.981705
C  -3.655721 2.184415 -2.076784
C  1.908051 -0.740182 -1.899036
C  2.467601 -0.795954 0.441515
C  3.445543 -0.100048 -0.15594
C  3.21333 -0.040885 -1.60341
C  2.322036 -1.07394 1.88951
C  4.622189 0.559465 0.498464
C  4.228513 1.745409 1.249805
C  3.87703 2.712751 1.870542
H  -1.801199 0.697133 -0.638612
H  -2.764566 -1.871864 0.795756
H  -0.683385 0.553927 2.829369
H  -1.483489 1.993639 2.213059
H  -0.331026 1.142622 1.20232
H  -4.241935 -0.527121 2.045909
H  -3.855086 1.119882 2.532897
H  -3.108921 -0.245194 3.360664
H  -4.565654 -0.63416 -0.260846
H  1.49928 -2.417151 -0.573442
H  1.185719 -0.011651 -2.274342
H  2.038439 -1.496903 -2.673266
H  -6.332206 0.038049 -1.552693
H  -6.40595 1.792647 -1.734753
H  -5.857672 0.804219 -3.070153
H  -2.650703 2.303989 -1.676966
H  -3.572212 2.084977 -3.162343
H  -4.193251 3.118909 -1.896681
H  3.217119 -0.812584 2.451015
H  2.099658 -2.127132 2.064214
H  1.492676 -0.500057 2.310361
H  5.124418 -0.140273 1.171679
H  5.358206 0.836699 -0.259698
H  3.573592 3.572248 2.425103
elementType: O C H
totalener: -964.17155608 hartree
nucrepener: 1783.65916734 hartree
electener: -2747.83072342 hartree
oneelecener: -4851.65979001 hartree
twoeener: 2103.82906659 hartree
cpcmener: -0.03256043 hartree
kineticenergy: 959.76684259 hartree
xcener: -94.695498367343 hartree
chargesum: -0.0000000
charge: -0.276782 -0.463763 -0.443562 0.123743 0.070628 -0.140469 -0.303972 -0.268645 -0.297509 0.410994 -0.040749 0.205456 -0.222332 -0.254275 -0.130799 -0.021393 -0.089164 0.286417 -0.258118 -0.100446 -0.448836 0.033183 0.098231 0.089348 0.102305 0.102392 0.090503 0.087512 0.096039 0.097924 0.117073 0.110394 0.102127 0.101519 0.088188 0.093261 0.092748 0.088804 0.097312 0.094515 0.105285 0.119386 0.123855 0.133289 0.111147 0.287234
qa: -0.2768 -0.4638 -0.4436 0.1237 0.0706 -0.1405 -0.3040 -0.2686 -0.2975 0.4110 -0.0407 0.2055 -0.2223 -0.2543 -0.1308 -0.0214 -0.0892 0.2864 -0.2581 -0.1004 -0.4488 0.0332 0.0982 0.0893 0.1023 0.1024 0.0905 0.0875 0.0960 0.0979 0.1171 0.1104 0.1021 0.1015 0.0882 0.0933 0.0927 0.0888 0.0973 0.0945 0.1053 0.1194 0.1239 0.1333 0.1111 0.2872
va: 2.1141 2.0374 2.0644 3.6689 3.7289 3.8964 3.9090 3.9083 3.8622 4.1741 3.7498 3.7742 3.9246 3.9450 3.9093 3.6965 3.5070 4.0642 3.9326 3.8855 3.8290 3.5522 1.0202 1.0351 0.9955 1.0035 1.0127 1.0059 1.0028 1.0020 1.0105 1.0301 1.0265 1.0234 1.0089 0.9965 0.9959 1.0101 0.9964 0.9978 1.0028 1.0104 0.9924 0.9887 1.0201 0.9471
dispcorr: -0.022552128 hartree
energy: -964.194108207847
dipole: -24.93219 23.66319 -1.26900 8.28270 -8.05730 0.22539 5.07547 -4.06648 1.00899
magnitude: 1.63683 au
magnitude: 4.16050 debye
