program: Gaussian 09
title: 000073189
version: EM64L-G09RevD.01
frameworkgroup: C1[X(C2H5O6P)]
method: RPBEPBE
basis: SDD
operation: Freq
keyword: #pfreq=noraman
keyword: PBEPBE/SDD
title: #p freq=noraman PBEPBE/SDD
converged: YES YES NO NO
title: Mulliken charges:
elementType: P O O O O O O C C H H H H H
charge: 1.244572 -0.395485 -0.662312 -0.671120 -0.598122 -0.381178 -0.218391 -0.468585 0.234444 0.339165 0.384446 0.397956 0.402002 0.392608
chargesum: 0.00000
title: Mulliken charges with hydrogens summed into heavy atoms:
elementType: P O O O O O O C C
charge: 1.244572 -0.011039 -0.264356 -0.269118 -0.598122 0.011430 -0.218391 -0.129421 0.234444
polarizability: 7.44323490e+01 -3.04325199e+00 6.59720075e+01 2.05311063e+00 5.15500481e+00 5.79706576e+01
1716.lowfreq: -14.7657 -11.1387 -4.4275 -0.0010 -0.0008 0.0013 28.8347 70.1910 104.5578
frequency: 28.5345 70.1729 104.5483 123.6802 157.5271 200.5807 236.0620 256.6683 290.7957 320.6342 345.0189 360.1954 415.6088 445.5744 541.6954 621.4814 635.5520 683.5327 713.1304 768.2783 868.0846 986.1466 1000.3249 1021.1963 1063.2223 1069.9306 1207.8341 1240.8097 1317.1744 1393.7751 1648.8276 3128.7804 3503.6358 3520.0188 3584.7868 3597.6367
redmass: 6.8816 10.6560 4.5738 5.1100 3.6324 3.1393 3.3695 2.9696 1.6111 3.4244 3.8562 3.8076 1.4530 5.9785 2.2512 3.1813 2.2712 8.9906 7.7560 6.7819 4.2544 1.6346 1.3379 4.0471 2.2221 3.1828 1.2596 1.2720 1.8935 1.3799 9.2132 1.0875 1.0653 1.0644 1.0662 1.0664
irintensity: 1.2064 2.3865 22.9287 4.3247 28.0012 29.6144 39.8807 63.3262 47.6997 79.8956 76.2781 29.1514 145.7888 17.6909 84.8081 116.3632 79.3962 101.8396 178.9407 80.8916 27.2333 2.1792 93.0581 136.0786 46.1336 291.1193 16.7433 44.2124 82.4532 27.7814 229.4909 1.5556 39.0113 44.0898 76.1179 54.5514
temp: 298.150 k
press: 1.00000 atm
elementType: 15 8 8 8 8 8 8 6 6 1 1 1 1 1
symmnumber: 1
zpe: 224129.1 jmol-1
zpe.correction: 0.085366 hartree
zpe.thermalcorrener: 0.096647 hartree
zpe.thermalcorrenthalpy: 0.097591 hartree
zpe.thermalcorrgfe: 0.047684 hartree
zpe.sumelectzpe: -871.041202 hartree
zpe.sumelectthermal: -871.029921 hartree
zpe.sumelectthermalent: -871.028977 hartree
zpe.sumelectthermalfe: -871.078884 hartree
dipole: -0.0966 -2.4386 -0.9357
dipole: 2.6138
quadrupole: -49.9507 -57.1526 -66.4573
quadrupole: -1.8216 0.5698 -5.4487
quadrupole: 7.9029 0.7009 -8.6038 -1.8216 0.5698 -5.4487
hfenergy: -871.1265685 hartree
pointgroup: C01 [X(C2H5O6P1)]
dipole: -0.124315 -0.8651186 -0.5418478 debye
dipolederiv: 1.8089253 -0.1586421 0.1622713 0.0978627 1.6482505 -0.0731348 0.1250081 -0.0639213 1.4530349 -0.5443814 -0.0968144 0.0725676 -0.2420327 -0.7706017 -0.039184 -0.0174271 -0.1612722 -0.1663406 -1.0348156 -0.0116754 -0.3102409 -0.015111 -0.5279446 0.1465866 -0.3396387 0.1975308 -0.7540731 -0.5103564 -0.0189929 -0.1020376 -0.1403736 -1.1920358 0.0529307 -0.0539991 0.0099651 -0.6010626 -0.728907 0.0042956 0.0628974 -0.0297672 -0.6051616 -0.0313502 0.0443389 -0.022431 -0.6626966 -0.4830096 0.1863454 0.2871186 0.2367468 -0.7803445 -0.4596667 0.228665 -0.3706616 -0.614897 -0.6497463 -0.0153223 -0.2482607 0.150255 -0.4980868 -0.1175246 -0.26315 -0.260683 -0.7030744 -0.1216342 0.2809672 -0.0674648 0.5265291 0.5373587 -0.0669278 -0.0614655 0.0811222 -0.0014177 1.0064338 -0.2643831 0.1269128 -0.6457334 0.8175103 0.5518884 0.3871706 0.593555 0.9958281 0.0566603 -0.0297866 0.0328047 -0.0043546 0.0650696 -0.0024764 -0.0045122 -0.0210768 0.0231628 0.4206693 0.0091512 -0.0599332 0.0238518 0.3770622 0.0888424 -0.0317461 0.0529374 0.1309682 0.3205304 0.0706778 0.0730147 0.0457679 0.2648805 -0.1012879 0.0323705 -0.0843459 0.2704221 0.188591 -0.0169849 0.0951141 -0.0664344 0.3188398 0.0295746 0.1122441 0.0105174 0.3591102 0.2710402 0.0611645 -0.1247639 0.0627936 0.3452034 0.0217298 -0.1578583 0.038764 0.2710356 unknown
polarizability: 74.0315435|-3.8390399|64.2545516|1.2641084|6.3447427|60.088919 unknown
InChI: InChI=1S/C2H5O6P/c3-1(4)2(5)9(6,7)8/h2-3,5-7H
charge 0 multiplicity 1
14 atoms
P  -1.36715 -0.110355 0.233663
O  0.394034 1.926887 -0.228294
O  -2.535063 0.056282 -1.043185
O  -1.06282 -1.804379 0.230756
O  -1.80362 0.575426 1.602283
O  1.79841 -1.291899 -0.924916
O  2.102008 0.011966 0.987742
C  0.274725 0.534323 -0.552179
C  1.476667 -0.264691 -0.059511
H  0.146795 0.434808 -1.637866
H  0.691014 2.016614 0.718133
H  -3.256302 0.704699 -0.834978
H  -1.779886 -2.378226 0.601381
H  2.546788 -1.836455 -0.558327
