program: Orca
programVersion: 5.0.2
elementType: O O O C C C C C C C C C C C C C C C C C C C H H H H H H H H H H H H H H H H H H H H H H H H
charge: 0
multiplicity: 1
keywords: wb97x-d3
keywords: def2-TZVPP
keywords: def2/J RIJCOSX
keywords: DEFGRID2
keywords: scfconv7
keywords: smallprint printgap noloewdin
keywords: NOSOSCF
formula: C19H24O3
InChI: InChI=1/C19H24O3/c1-7-8-13-12(4)16(10-15(13)20)22-18(21)17-14(9-11(2)3)19(17,5)6/h1,9,14,16-17H,8,10H2,2-6H3
46 atoms
O  0.493018 0.031413 0.235177
O  -0.802558 -1.167586 1.601862
O  4.562945 -2.149587 0.398846
C  -2.698465 -1.189937 -0.904717
C  -3.189379 -0.167671 0.074011
C  -1.736007 -0.14827 -0.356476
C  -2.612273 -2.628601 -0.457699
C  -3.057048 -1.04789 -2.364201
C  -4.061494 0.957424 -0.323151
C  -0.676427 -0.496162 0.605384
C  -5.241348 1.275629 0.218758
C  1.629434 -0.216912 1.064952
C  -6.019657 2.458292 -0.275032
C  -5.899518 0.517695 1.330549
C  2.245585 -1.597816 0.870993
C  2.700086 0.755191 0.649419
C  3.855406 0.132842 0.377817
C  3.690384 -1.31808 0.524981
C  2.422895 2.210003 0.600209
C  5.155693 0.762627 -0.022879
C  5.111504 1.301921 -1.376581
C  5.059665 1.755084 -2.488558
H  -3.34854 -0.558056 1.073669
H  -1.460068 0.627082 -1.062916
H  -3.534964 -3.147724 -0.725076
H  -2.479881 -2.739177 0.616036
H  -1.790178 -3.148141 -0.955012
H  -2.362231 -1.615258 -2.986483
H  -3.035934 -0.014593 -2.708355
H  -4.060101 -1.438188 -2.549479
H  -3.695568 1.580573 -1.134438
H  1.363399 -0.037884 2.111048
H  1.777838 -2.137167 0.043408
H  2.172535 -2.231267 1.755125
H  -6.999793 2.155409 -0.653429
H  -6.208806 3.168672 0.534458
H  -5.50209 2.990808 -1.073238
H  -5.329358 -0.34242 1.676096
H  -6.077816 1.16762 2.191108
H  -6.880361 0.15341 1.013059
H  1.811022 2.520821 1.448605
H  1.863379 2.462193 -0.303997
H  3.33642 2.802623 0.595984
H  5.41831 1.56449 0.67256
H  5.958163 0.024104 0.045312
H  5.017744 2.151816 -3.477952
elementType: O C H
totalener: -964.17519774 hartree
nucrepener: 1734.15219223 hartree
electener: -2698.32738997 hartree
oneelecener: -4753.05518647 hartree
twoeener: 2054.72779650 hartree
cpcmener: -0.03248681 hartree
kineticenergy: 959.76694752 hartree
xcener: -94.694070213727 hartree
chargesum: -0.0000000
charge: -0.292059 -0.470387 -0.443543 0.111186 0.034936 -0.095510 -0.280696 -0.262571 -0.278729 0.386101 -0.042855 0.233431 -0.219108 -0.251567 -0.136207 -0.021498 -0.079566 0.289435 -0.273058 -0.101789 -0.454790 0.043523 0.094419 0.088624 0.096235 0.093722 0.098165 0.097558 0.086984 0.096892 0.117950 0.104704 0.104127 0.103552 0.093056 0.092860 0.087550 0.089492 0.095826 0.095066 0.117417 0.115708 0.103998 0.132845 0.111311 0.287263
qa: -0.2921 -0.4704 -0.4435 0.1112 0.0349 -0.0955 -0.2807 -0.2626 -0.2787 0.3861 -0.0429 0.2334 -0.2191 -0.2516 -0.1362 -0.0215 -0.0796 0.2894 -0.2731 -0.1018 -0.4548 0.0435 0.0944 0.0886 0.0962 0.0937 0.0982 0.0976 0.0870 0.0969 0.1179 0.1047 0.1041 0.1036 0.0931 0.0929 0.0876 0.0895 0.0958 0.0951 0.1174 0.1157 0.1040 0.1328 0.1113 0.2873
va: 2.1320 2.0392 2.0659 3.6917 3.7734 3.8800 3.9041 3.9059 3.8732 4.1567 3.7545 3.7908 3.9225 3.9438 3.8889 3.7216 3.5199 4.0643 3.9531 3.8764 3.8304 3.5362 1.0306 1.0358 1.0004 1.0192 0.9996 1.0024 1.0057 1.0024 1.0101 1.0170 1.0236 1.0247 0.9965 0.9963 1.0090 1.0099 0.9971 0.9975 1.0014 0.9991 1.0007 0.9883 1.0203 0.9468
dispcorr: -0.020720590 hartree
energy: -964.195918334316
dipole: -31.41666 29.80269 -1.61397 6.04893 -4.11490 1.93403 -3.94576 3.71795 -0.22781
magnitude: 2.52928 au
magnitude: 6.42891 debye
