program: Orca
programVersion: 5.0.2
elementType: O O O C C C C C C C C C C C C C C C C C C C H H H H H H H H H H H H H H H H H H H H H H H H
charge: 0
multiplicity: 1
keywords: wb97x-d3
keywords: def2-TZVPP
keywords: def2/J RIJCOSX
keywords: DEFGRID2
keywords: scfconv7
keywords: smallprint printgap noloewdin
keywords: NOSOSCF
formula: C19H24O3
InChI: InChI=1/C19H24O3/c1-7-8-13-12(4)16(10-15(13)20)22-18(21)17-14(9-11(2)3)19(17,5)6/h1,9,14,16-17H,8,10H2,2-6H3
46 atoms
O  0.269184 -1.065044 -0.160964
O  -0.679337 -0.735502 1.842536
O  4.81593 -1.444138 -1.051452
C  -3.240018 -1.805116 0.34339
C  -3.28325 -0.324511 0.482454
C  -2.042581 -0.978747 -0.106834
C  -3.158457 -2.657277 1.585894
C  -4.013705 -2.46254 -0.774215
C  -4.138537 0.546423 -0.362374
C  -0.783334 -0.916251 0.652275
C  -3.891232 1.834801 -0.613663
C  1.587743 -0.919326 0.3667
C  -4.818944 2.660551 -1.450025
C  -2.686236 2.558276 -0.096669
C  2.550599 -1.891683 -0.298844
C  2.137976 0.449611 0.049759
C  3.365509 0.369351 -0.484443
C  3.741541 -1.037585 -0.665206
C  1.37016 1.673846 0.375956
C  4.282217 1.500292 -0.848841
C  4.717919 2.259412 0.317101
C  5.058834 2.883315 1.286028
H  -3.130422 0.030513 1.498633
H  -1.923016 -0.901737 -1.181557
H  -4.164872 -2.9436 1.898386
H  -2.69224 -2.14783 2.426287
H  -2.601285 -3.577124 1.396374
H  -5.05199 -2.627694 -0.47839
H  -3.582733 -3.436168 -1.01514
H  -4.018834 -1.871198 -1.689977
H  -5.037716 0.102175 -0.779695
H  1.574986 -1.061766 1.449767
H  2.121481 -2.306065 -1.215033
H  2.838273 -2.728024 0.338107
H  -4.301715 3.067831 -2.322936
H  -5.676273 2.087683 -1.80377
H  -5.196107 3.518872 -0.887511
H  -2.095433 2.961527 -0.923733
H  -2.982688 3.416306 0.512754
H  -2.03171 1.932976 0.508495
H  0.418386 1.687772 -0.160706
H  1.908544 2.583546 0.119119
H  1.132116 1.707198 1.441385
H  5.158062 1.107953 -1.370763
H  3.787855 2.176603 -1.551553
H  5.36517 3.434647 2.146625
elementType: O C H
totalener: -964.17232331 hartree
nucrepener: 1768.66627126 hartree
electener: -2732.83859457 hartree
oneelecener: -4821.78874561 hartree
twoeener: 2088.95015103 hartree
cpcmener: -0.03044375 hartree
kineticenergy: 959.76423104 hartree
xcener: -94.695100670814 hartree
chargesum: -0.0000000
charge: -0.291317 -0.468545 -0.445289 0.151956 -0.025390 -0.086264 -0.273002 -0.291383 -0.293606 0.360588 -0.001564 0.247190 -0.228641 -0.247215 -0.135756 -0.017529 -0.089071 0.288874 -0.254471 -0.104949 -0.460828 0.049321 0.103530 0.090135 0.094569 0.092396 0.098712 0.100332 0.098169 0.091751 0.121817 0.106360 0.102085 0.097742 0.094320 0.089407 0.095172 0.099550 0.103265 0.070410 0.112404 0.101577 0.120802 0.110800 0.134240 0.287347
qa: -0.2913 -0.4685 -0.4453 0.1520 -0.0254 -0.0863 -0.2730 -0.2914 -0.2936 0.3606 -0.0016 0.2472 -0.2286 -0.2472 -0.1358 -0.0175 -0.0891 0.2889 -0.2545 -0.1049 -0.4608 0.0493 0.1035 0.0901 0.0946 0.0924 0.0987 0.1003 0.0982 0.0918 0.1218 0.1064 0.1021 0.0977 0.0943 0.0894 0.0952 0.0995 0.1033 0.0704 0.1124 0.1016 0.1208 0.1108 0.1342 0.2873
va: 2.1212 2.0319 2.0608 3.7145 3.8153 3.7964 3.8898 3.9126 3.8940 4.1886 3.6910 3.7641 3.9298 3.9466 3.9127 3.7043 3.5231 4.0603 3.9317 3.8776 3.8262 3.5295 1.0268 1.0344 1.0011 1.0180 0.9995 0.9989 1.0029 1.0011 1.0042 1.0324 1.0271 1.0254 0.9965 1.0064 0.9960 0.9964 1.0006 1.0140 1.0034 1.0051 1.0025 1.0206 0.9878 0.9467
dispcorr: -0.022342146 hartree
energy: -964.194665456875
dipole: -28.33389 26.19094 -2.14295 5.83420 -5.02935 0.80486 -1.94854 1.43142 -0.51712
magnitude: 2.34679 au
magnitude: 5.96507 debye
