program: Orca
programVersion: 5.0.2
elementType: O O O C C C C C C C C C C C C C C C C C C C H H H H H H H H H H H H H H H H H H H H H H H H
charge: 0
multiplicity: 1
keywords: wb97x-d3
keywords: def2-TZVPP
keywords: def2/J RIJCOSX
keywords: DEFGRID2
keywords: scfconv7
keywords: smallprint printgap noloewdin
keywords: NOSOSCF
formula: C19H24O3
InChI: InChI=1/C19H24O3/c1-7-8-13-12(4)16(10-15(13)20)22-18(21)17-14(9-11(2)3)19(17,5)6/h1,9,14,16-17H,8,10H2,2-6H3
46 atoms
O  0.198908 -0.941969 -0.26763
O  -0.335244 -2.714778 0.994146
O  4.07501 0.1650 -2.443023
C  -2.221449 0.376578 1.109521
C  -2.527672 -0.012384 -0.305951
C  -1.973169 -1.048092 0.639704
C  -1.078936 1.324509 1.384455
C  -3.372219 0.553211 2.070568
C  -3.918031 -0.156265 -0.810659
C  -0.636299 -1.665087 0.491143
C  -4.643713 0.837025 -1.325555
C  1.527439 -1.417709 -0.486765
C  -6.028957 0.60533 -1.848148
C  -4.143478 2.245254 -1.433829
C  2.009437 -0.981439 -1.865077
C  2.491347 -0.778349 0.485442
C  3.484904 -0.144325 -0.148829
C  3.312829 -0.248581 -1.608035
C  2.299266 -0.907514 1.951744
C  4.644716 0.591727 0.452714
C  4.226871 1.743202 1.24181
C  3.868307 2.681524 1.897883
H  -1.812698 0.35846 -1.034471
H  -2.685038 -1.769806 1.026152
H  -0.629896 1.124234 2.359842
H  -1.454083 2.349616 1.409405
H  -0.292386 1.283624 0.635571
H  -4.176467 -0.160404 1.8971
H  -3.799746 1.552845 1.971443
H  -3.034382 0.434814 3.101543
H  -4.356582 -1.149048 -0.768321
H  1.546257 -2.504401 -0.370759
H  1.298801 -0.301146 -2.338281
H  2.163047 -1.813831 -2.552274
H  -6.755135 1.237632 -1.331518
H  -6.095698 0.858676 -2.909122
H  -6.342992 -0.431147 -1.731798
H  -4.833216 2.938077 -0.945688
H  -3.161617 2.383383 -0.985043
H  -4.081916 2.557288 -2.47955
H  3.165963 -0.560066 2.509914
H  2.086573 -1.940781 2.227248
H  1.445245 -0.311357 2.280689
H  5.236873 -0.080671 1.080589
H  5.306791 0.921533 -0.351705
H  3.55445 3.519315 2.47161
totalener: -964.14651494 hartree
nucrepener: 1788.00757322 hartree
electener: -2752.15408816 hartree
oneelecener: -4860.39151882 hartree
twoeener: 2108.23743066 hartree
kineticenergy: 959.82253111 hartree
xcener: -94.697613481472 hartree
chargesum: 0.0000000
charge: -0.273507 -0.364184 -0.328772 0.119939 0.003146 -0.121514 -0.317635 -0.242767 -0.217616 0.332855 -0.022386 0.178071 -0.210952 -0.237809 -0.131480 -0.047062 -0.056535 0.218123 -0.240513 -0.154764 -0.410749 0.086183 0.104880 0.083802 0.094926 0.092060 0.100249 0.083558 0.086098 0.095773 0.092341 0.104164 0.090488 0.090355 0.084752 0.086829 0.080438 0.086361 0.079897 0.097113 0.095489 0.123681 0.104425 0.118381 0.118995 0.244872
qa: -0.2735 -0.3642 -0.3288 0.1199 0.0031 -0.1215 -0.3176 -0.2428 -0.2176 0.3329 -0.0224 0.1781 -0.2110 -0.2378 -0.1315 -0.0471 -0.0565 0.2181 -0.2405 -0.1548 -0.4107 0.0862 0.1049 0.0838 0.0949 0.0921 0.1002 0.0836 0.0861 0.0958 0.0923 0.1042 0.0905 0.0904 0.0848 0.0868 0.0804 0.0864 0.0799 0.0971 0.0955 0.1237 0.1044 0.1184 0.1190 0.2449
va: 2.0802 2.1370 2.1746 3.6453 3.7841 3.9181 3.9104 3.9110 3.8604 4.2730 3.7375 3.7913 3.9414 3.9421 3.8780 3.6791 3.4689 4.1135 3.9566 3.9166 3.8631 3.5851 1.0162 1.0329 0.9995 1.0077 1.0136 1.0076 1.0030 1.0047 1.0145 1.0286 1.0303 1.0275 0.9992 0.9980 1.0105 1.0007 1.0101 1.0016 1.0039 1.0102 0.9984 0.9856 1.0197 0.9734
dispcorr: -0.023438478 hartree
energy: -964.169953416909
dipole: -26.15516 25.03404 -1.12112 9.95101 -9.57515 0.37586 4.79150 -4.17811 0.61339
magnitude: 1.33208 au
magnitude: 3.38587 debye
