program: Orca
programVersion: 5.0.2
elementType: O O O C C C C C C C C C C C C C C C C C C C H H H H H H H H H H H H H H H H H H H H H H H H
charge: 0
multiplicity: 1
keywords: wb97x-d3
keywords: def2-TZVPP
keywords: def2/J RIJCOSX
keywords: DEFGRID2
keywords: scfconv7
keywords: smallprint printgap noloewdin
keywords: NOSOSCF
formula: C19H24O3
InChI: InChI=1/C19H24O3/c1-7-8-13-12(4)16(10-15(13)20)22-18(21)17-14(9-11(2)3)19(17,5)6/h1,9,14,16-17H,8,10H2,2-6H3
46 atoms
O  0.40064 -1.515759 -0.204584
O  0.081068 0.68726 -0.439661
O  4.194904 0.397352 -2.339076
C  -2.580851 -0.046522 1.083141
C  -2.853545 0.232609 -0.363543
C  -1.777096 -0.754589 0.002704
C  -1.951654 1.031767 1.930649
C  -3.550988 -0.914836 1.845369
C  -4.082972 -0.242322 -1.048224
C  -0.360022 -0.414716 -0.243889
C  -5.219432 0.450333 -1.133162
C  1.807399 -1.394299 -0.388473
C  -6.407217 -0.083291 -1.87449
C  -5.40304 1.802624 -0.514777
C  2.275106 -0.985112 -1.782304
C  2.489321 -0.430775 0.552784
C  3.439316 0.270184 -0.076097
C  3.427903 -0.034056 -1.516851
C  2.134451 -0.396475 1.994811
C  4.405971 1.262003 0.500202
C  5.270186 0.69948 1.529883
C  5.974583 0.233071 2.382237
H  -2.464192 1.184993 -0.713484
H  -2.013973 -1.806189 -0.120406
H  -2.73475 1.637883 2.390519
H  -1.307717 1.69897 1.362498
H  -1.361432 0.598416 2.741448
H  -3.983641 -1.699803 1.226588
H  -4.377736 -0.314487 2.229822
H  -3.05811 -1.389178 2.695916
H  -4.036177 -1.216794 -1.525743
H  2.163681 -2.401834 -0.154921
H  1.50292 -0.449552 -2.33625
H  2.594459 -1.826263 -2.397509
H  -6.694317 0.585866 -2.6893
H  -6.21638 -1.066917 -2.301668
H  -7.276984 -0.164081 -1.217855
H  -6.26852 1.807874 0.152155
H  -4.538759 2.127141 0.061304
H  -5.598913 2.557042 -1.28084
H  2.930873 0.033756 2.598204
H  1.918338 -1.395302 2.376028
H  1.236558 0.206623 2.147673
H  5.023588 1.655587 -0.310975
H  3.862714 2.117127 0.912894
H  6.609274 -0.17856 3.129157
totalener: -964.14608043 hartree
nucrepener: 1772.03278384 hartree
electener: -2736.17886427 hartree
oneelecener: -4828.74210531 hartree
twoeener: 2092.56324104 hartree
kineticenergy: 959.82737147 hartree
xcener: -94.701073274355 hartree
chargesum: 0.0000000
charge: -0.272351 -0.380995 -0.334446 0.120033 -0.037074 -0.106522 -0.302259 -0.241737 -0.190577 0.312422 -0.028047 0.249087 -0.211616 -0.233960 -0.151813 -0.003094 -0.077469 0.218320 -0.267255 -0.169621 -0.417136 0.093016 0.109620 0.078126 0.092573 0.109264 0.083661 0.082497 0.087894 0.093260 0.089700 0.098312 0.101319 0.090667 0.087164 0.079393 0.084403 0.085221 0.080074 0.096000 0.107102 0.100058 0.110719 0.118114 0.123645 0.244310
qa: -0.2724 -0.3810 -0.3344 0.1200 -0.0371 -0.1065 -0.3023 -0.2417 -0.1906 0.3124 -0.0280 0.2491 -0.2116 -0.2340 -0.1518 -0.0031 -0.0775 0.2183 -0.2673 -0.1696 -0.4171 0.0930 0.1096 0.0781 0.0926 0.1093 0.0837 0.0825 0.0879 0.0933 0.0897 0.0983 0.1013 0.0907 0.0872 0.0794 0.0844 0.0852 0.0801 0.0960 0.1071 0.1001 0.1107 0.1181 0.1236 0.2443
va: 2.1303 2.1164 2.1685 3.6691 3.8225 3.8987 3.9039 3.9060 3.8563 4.2718 3.7433 3.8098 3.9407 3.9405 3.8572 3.6261 3.5288 4.1177 3.9403 3.9046 3.8800 3.5664 1.0236 1.0382 1.0064 1.0154 1.0029 1.0077 1.0041 1.0048 1.0140 0.9914 1.0289 1.0268 0.9979 1.0107 0.9989 1.0004 1.0114 1.0013 1.0136 1.0040 1.0001 1.0186 0.9840 0.9735
dispcorr: -0.022879748 hartree
energy: -964.168960179034
dipole: -32.27869 30.62657 -1.65212 2.24020 -2.97112 -0.73092 8.68355 -7.52758 1.15598
magnitude: 2.14477 au
magnitude: 5.45156 debye
