program: Orca
programVersion: 5.0.2
elementType: O O O C C C C C C C C C C C C C C C C C C C H H H H H H H H H H H H H H H H H H H H H H H H
charge: 0
multiplicity: 1
keywords: wb97x-d3
keywords: def2-TZVPP
keywords: def2/J RIJCOSX
keywords: DEFGRID2
keywords: scfconv7
keywords: smallprint printgap noloewdin
keywords: NOSOSCF
formula: C19H24O3
InChI: InChI=1/C19H24O3/c1-7-8-13-12(4)16(10-15(13)20)22-18(21)17-14(9-11(2)3)19(17,5)6/h1,9,14,16-17H,8,10H2,2-6H3
46 atoms
O  0.433147 -1.004306 -0.185046
O  -0.576042 -0.488342 1.750721
O  4.866614 -1.664801 -1.16428
C  -3.103231 -1.61679 0.264086
C  -3.114041 -0.119375 0.233656
C  -1.875233 -0.868871 -0.221893
C  -3.1038 -2.304181 1.607989
C  -3.859297 -2.392172 -0.789081
C  -3.888759 0.665009 -0.743946
C  -0.639941 -0.762049 0.580787
C  -4.573983 1.786878 -0.509656
C  1.732732 -0.933953 0.40079
C  -5.314237 2.47647 -1.617145
C  -4.688449 2.460305 0.824318
C  2.646427 -1.978754 -0.226957
C  2.384685 0.393704 0.093331
C  3.586259 0.232816 -0.474656
C  3.861812 -1.199039 -0.692082
C  1.707086 1.665957 0.448729
C  4.578354 1.283586 -0.878399
C  4.998223 2.134677 0.22734
C  5.333829 2.839359 1.138394
H  -2.998245 0.332321 1.2124
H  -1.706734 -0.915665 -1.292046
H  -2.609963 -3.2762 1.548599
H  -4.133036 -2.478638 1.926568
H  -2.608951 -1.724163 2.382564
H  -4.916701 -2.45884 -0.527792
H  -3.469787 -3.40867 -0.864254
H  -3.793684 -1.945677 -1.780196
H  -3.892128 0.286485 -1.761804
H  1.652541 -1.060011 1.483627
H  2.170953 -2.456323 -1.08576
H  2.937547 -2.771048 0.463053
H  -4.938894 3.491977 -1.767356
H  -5.228173 1.945018 -2.564124
H  -6.377222 2.570454 -1.381111
H  -5.726995 2.460695 1.164927
H  -4.088669 1.99781 1.604658
H  -4.38568 3.507768 0.753223
H  0.794713 1.790431 -0.138765
H  2.341342 2.532521 0.278637
H  1.40492 1.661186 1.49707
H  5.454542 0.788512 -1.304738
H  4.163594 1.907432 -1.675755
H  5.646855 3.453285 1.947388
totalener: -964.15068647 hartree
nucrepener: 1740.19994521 hartree
electener: -2704.35063168 hartree
oneelecener: -4764.91256880 hartree
twoeener: 2060.56193712 hartree
kineticenergy: 959.82097351 hartree
xcener: -94.699106444810 hartree
chargesum: 0.0000000
charge: -0.276162 -0.390303 -0.330448 0.079641 0.044448 -0.090294 -0.255577 -0.249111 -0.188844 0.321835 -0.053852 0.228400 -0.200848 -0.238187 -0.140567 -0.058229 -0.063223 0.223199 -0.232729 -0.153602 -0.424650 0.101352 0.092010 0.071842 0.084083 0.087143 0.100746 0.094954 0.091221 0.072089 0.071657 0.100156 0.090826 0.088266 0.085156 0.076325 0.084092 0.089136 0.084493 0.084363 0.102834 0.096502 0.115040 0.118899 0.120475 0.245442
qa: -0.2762 -0.3903 -0.3304 0.0796 0.0444 -0.0903 -0.2556 -0.2491 -0.1888 0.3218 -0.0539 0.2284 -0.2008 -0.2382 -0.1406 -0.0582 -0.0632 0.2232 -0.2327 -0.1536 -0.4246 0.1014 0.0920 0.0718 0.0841 0.0871 0.1007 0.0950 0.0912 0.0721 0.0717 0.1002 0.0908 0.0883 0.0852 0.0763 0.0841 0.0891 0.0845 0.0844 0.1028 0.0965 0.1150 0.1189 0.1205 0.2454
va: 2.1185 2.1083 2.1727 3.7469 3.7810 3.8609 3.9138 3.9175 3.9041 4.2514 3.8292 3.7448 3.9332 3.9441 3.8777 3.7301 3.4962 4.1071 3.9397 3.8991 3.8705 3.5623 1.0323 1.0394 1.0028 1.0010 1.0214 1.0031 1.0045 1.0107 1.0224 1.0298 1.0321 1.0279 0.9986 1.0124 0.9980 0.9986 1.0161 0.9994 1.0035 1.0099 1.0077 1.0195 0.9851 0.9728
dispcorr: -0.020765883 hartree
energy: -964.171452349742
dipole: -32.19034 30.60480 -1.58553 5.72600 -5.21404 0.51196 -0.07208 -0.02996 -0.10204
magnitude: 1.66926 au
magnitude: 4.24292 debye
