program: Orca
programVersion: 5.0.2
elementType: O O O C C C C C C C C C C C C C C C C C C C C C C C H H H H H H H H H H H H H H H H H H H H H H H H H H
charge: 0
multiplicity: 1
keywords: wb97x-d3
keywords: def2-TZVPP
keywords: def2/J RIJCOSX
keywords: DEFGRID2
keywords: scfconv7
keywords: smallprint printgap noloewdin
keywords: NOSOSCF
formula: C23H26O3
InChI: InChI=1/C23H26O3/c1-16(2)13-20-21(23(20,3)4)22(24)25-15-17-9-8-12-19(14-17)26-18-10-6-5-7-11-18/h5-14,20-21H,15H2,1-4H3
52 atoms
O  -1.401675 0.603092 1.976734
O  -2.653075 1.492282 0.355951
O  2.921782 0.377948 -0.924323
C  -4.162033 -1.216476 0.250956
C  -2.906537 -1.455349 -0.514861
C  -2.846532 -0.838911 0.896376
C  -4.819349 -2.430586 0.867656
C  -5.169357 -0.181986 -0.187266
C  -2.515316 -0.668345 -1.706791
C  -2.33799 0.533125 1.023071
C  -1.288682 -0.694519 -2.236284
C  -0.944767 0.093766 -3.461287
C  -0.171811 -1.51191 -1.652714
C  -0.681753 1.833272 2.101739
C  0.235788 2.06775 0.93413
C  1.155864 1.085593 0.576488
C  0.176804 3.255236 0.21675
C  2.01907 1.309027 -0.486706
C  1.043161 3.465072 -0.847768
C  1.967974 2.498209 -1.204787
C  3.454435 -0.548719 -0.062654
C  3.538742 -1.857917 -0.513677
C  3.962752 -0.190411 1.180226
C  4.145269 -2.817124 0.286071
C  4.552139 -1.162803 1.97516
C  4.6482 -2.476367 1.533792
H  -2.552305 -2.482317 -0.515556
H  -2.497506 -1.510369 1.671735
H  -5.505911 -2.895221 0.157455
H  -5.393419 -2.155823 1.754357
H  -4.087944 -3.183702 1.163237
H  -5.87961 -0.642589 -0.876863
H  -4.742663 0.681814 -0.687941
H  -5.737755 0.179662 0.671431
H  -3.274982 -0.058304 -2.184528
H  -1.806647 0.621533 -3.86905
H  -0.538446 -0.551257 -4.244821
H  -0.169077 0.831706 -3.237101
H  -0.197409 -1.543999 -0.563112
H  0.798689 -1.119321 -1.954712
H  -0.215408 -2.545411 -2.00738
H  -0.10959 1.719398 3.022019
H  -1.364652 2.673767 2.23699
H  1.193891 0.155486 1.130661
H  -0.545394 4.014535 0.488204
H  0.99762 4.389401 -1.408192
H  2.645831 2.658687 -2.033515
H  3.141211 -2.121552 -1.485615
H  3.909427 0.833936 1.526483
H  4.215405 -3.837008 -0.068533
H  4.949555 -0.884745 2.942481
H  5.114955 -3.227069 2.157209
elementType: O C H
totalener: -1117.85224585 hartree
nucrepener: 2350.11950379 hartree
electener: -3467.97174964 hartree
oneelecener: -6190.67329139 hartree
twoeener: 2722.70154175 hartree
cpcmener: -0.03177364 hartree
kineticenergy: 1112.80193649 hartree
xcener: -110.229306633215 hartree
chargesum: -0.0000000
charge: -0.298050 -0.490083 -0.339756 0.140065 -0.027777 -0.090673 -0.264574 -0.295003 -0.276999 0.388738 -0.005560 -0.214903 -0.317361 0.096962 0.033033 -0.249892 -0.222312 0.312169 -0.099226 -0.296667 0.295854 -0.259753 -0.200750 -0.122451 -0.146779 -0.188255 0.115097 0.094163 0.095476 0.096595 0.088095 0.099830 0.089635 0.102149 0.128811 0.089635 0.102053 0.087077 0.098929 0.090092 0.125586 0.126316 0.115383 0.140484 0.144626 0.160935 0.146686 0.157835 0.158796 0.161558 0.162365 0.161797
qa: -0.2981 -0.4901 -0.3398 0.1401 -0.0278 -0.0907 -0.2646 -0.2950 -0.2770 0.3887 -0.0056 -0.2149 -0.3174 0.0970 0.0330 -0.2499 -0.2223 0.3122 -0.0992 -0.2967 0.2959 -0.2598 -0.2008 -0.1225 -0.1468 -0.1883 0.1151 0.0942 0.0955 0.0966 0.0881 0.0998 0.0896 0.1021 0.1288 0.0896 0.1021 0.0871 0.0989 0.0901 0.1256 0.1263 0.1154 0.1405 0.1446 0.1609 0.1467 0.1578 0.1588 0.1616 0.1624 0.1618
va: 2.1036 1.9958 2.0355 3.7719 3.7832 3.8409 3.8950 3.8878 3.8276 4.1214 3.6934 3.9154 3.9625 3.8047 3.6203 3.8759 3.9559 3.5887 3.8772 4.0020 3.6715 3.9811 3.9251 3.8872 3.8842 3.9055 1.0025 1.0312 1.0024 1.0025 1.0041 0.9989 1.0201 0.9996 1.0010 1.0088 0.9951 0.9943 0.9945 1.0077 0.9976 0.9935 1.0074 1.0178 1.0045 0.9870 1.0084 0.9994 0.9962 0.9890 0.9891 0.9892
dispcorr: -0.028794522 hartree
energy: -1117.881040370290
dipole: -16.63243 17.11667 0.48424 -9.80050 8.80694 -0.99356 -6.07933 6.98968 0.91035
magnitude: 1.43192 au
magnitude: 3.63965 debye
