program: Orca
programVersion: 5.0.2
elementType: O O O C C C C C C C C C C C C C C C C C C C C C C C H H H H H H H H H H H H H H H H H H H H H H H H H H
charge: 0
multiplicity: 1
keywords: wb97x-d3
keywords: def2-TZVPP
keywords: def2/J RIJCOSX
keywords: DEFGRID2
keywords: scfconv7
keywords: smallprint printgap noloewdin
keywords: NOSOSCF
formula: C23H26O3
InChI: InChI=1/C23H26O3/c1-16(2)13-20-21(23(20,3)4)22(24)25-15-17-9-8-12-19(14-17)26-18-10-6-5-7-11-18/h5-14,20-21H,15H2,1-4H3
52 atoms
O  -1.355486 1.41563 -0.924948
O  -1.386238 0.929499 1.259105
O  3.636997 0.538821 -0.268304
C  -1.604151 -2.015214 0.184569
C  -2.988073 -1.5807 0.511786
C  -2.113133 -0.688144 -0.363426
C  -1.440073 -3.100766 -0.851695
C  -0.531671 -2.050318 1.243365
C  -3.413614 -1.202175 1.883114
C  -1.596781 0.601123 0.114524
C  -4.381029 -0.32526 2.160825
C  -4.784771 -0.02256 3.570557
C  -5.110174 0.448741 1.106261
C  -0.805674 2.702506 -0.675029
C  0.700863 2.709081 -0.673369
C  1.452895 1.556712 -0.484746
C  1.347465 3.929012 -0.855309
C  2.841243 1.630764 -0.493378
C  2.73132 3.990571 -0.847803
C  3.490042 2.84234 -0.675516
C  3.229012 -0.722422 -0.623814
C  2.614064 -0.989015 -1.841324
C  3.5230 -1.749574 0.261592
C  2.282785 -2.298079 -2.15853
C  3.200409 -3.056444 -0.076732
C  2.572739 -3.336061 -1.282335
H  -3.765222 -2.061619 -0.077419
H  -2.35302 -0.694403 -1.419991
H  -0.475351 -3.01735 -1.355857
H  -2.220747 -3.057677 -1.6118
H  -1.485708 -4.085518 -0.382464
H  0.450488 -1.872639 0.798678
H  -0.50589 -3.041093 1.700727
H  -0.670959 -1.328462 2.043561
H  -2.914818 -1.703317 2.707739
H  -5.838916 -0.258745 3.73506
H  -4.670219 1.042282 3.789637
H  -4.195391 -0.581825 4.296686
H  -6.186499 0.438454 1.288193
H  -4.937754 0.073555 0.099567
H  -4.804745 1.498176 1.125529
H  -1.188694 3.117719 0.259493
H  -1.171532 3.337014 -1.482015
H  0.978743 0.595403 -0.338973
H  0.765826 4.829784 -1.009118
H  3.229225 4.940103 -0.993442
H  4.571557 2.885053 -0.680748
H  2.396888 -0.191702 -2.540558
H  4.007532 -1.526832 1.203813
H  1.80101 -2.505373 -3.105041
H  3.434505 -3.856462 0.613043
H  2.314391 -4.354228 -1.540439
elementType: O C H
totalener: -1117.85284356 hartree
nucrepener: 2335.64983053 hartree
electener: -3453.50267409 hartree
oneelecener: -6161.42278159 hartree
twoeener: 2707.92010750 hartree
cpcmener: -0.03159977 hartree
kineticenergy: 1112.79845096 hartree
xcener: -110.232453612231 hartree
chargesum: -0.0000000
charge: -0.299338 -0.485313 -0.335875 0.149641 -0.011974 -0.095525 -0.274399 -0.262584 -0.290418 0.381890 -0.021112 -0.225986 -0.269796 0.095768 0.020766 -0.221224 -0.246081 0.317577 -0.106979 -0.270694 0.298548 -0.205848 -0.232226 -0.144788 -0.123251 -0.200851 0.117032 0.094983 0.088115 0.093475 0.098334 0.038218 0.109398 0.099902 0.124136 0.096408 0.094502 0.089447 0.104660 0.096068 0.100432 0.112429 0.126624 0.133954 0.143874 0.159864 0.146681 0.159226 0.146556 0.164661 0.159908 0.161185
qa: -0.2993 -0.4853 -0.3359 0.1496 -0.0120 -0.0955 -0.2744 -0.2626 -0.2904 0.3819 -0.0211 -0.2260 -0.2698 0.0958 0.0208 -0.2212 -0.2461 0.3176 -0.1070 -0.2707 0.2985 -0.2058 -0.2322 -0.1448 -0.1233 -0.2009 0.1170 0.0950 0.0881 0.0935 0.0983 0.0382 0.1094 0.0999 0.1241 0.0964 0.0945 0.0894 0.1047 0.0961 0.1004 0.1124 0.1266 0.1340 0.1439 0.1599 0.1467 0.1592 0.1466 0.1647 0.1599 0.1612
va: 2.1097 1.9890 2.0770 3.7027 3.8321 3.8221 3.8992 3.8895 3.8556 4.1060 3.7039 3.9266 3.9446 3.8403 3.6802 3.9392 3.9712 3.7090 3.8825 4.0026 3.6567 3.8938 3.9620 3.8206 3.8436 3.8547 1.0021 1.0309 1.0104 1.0071 1.0015 1.0292 1.0003 1.0194 1.0007 0.9966 0.9958 1.0069 1.0005 1.0046 0.9978 1.0125 0.9936 0.9911 1.0008 0.9879 1.0083 0.9944 1.0079 0.9886 0.9887 0.9900
dispcorr: -0.028230531 hartree
energy: -1117.881074093183
dipole: -22.34377 21.50114 -0.84263 -10.76802 10.42345 -0.34457 6.83587 -8.03801 -1.20214
magnitude: 1.50795 au
magnitude: 3.83289 debye
