program: Orca
programVersion: 5.0.4
elementType: C C C C C N C C C C H H H C N C C H C O C O N N C H H H C H H H C H H H C H H H Yb N O O O N O O O N O O O C N C N
elementType: Yb
keywords: def2-SVPD def2/JK def2/J def2-SVPD/C PBE rijcosx rhf hcore XYZFile VeryTightSCF freq cpcm(water) D3 defgrid3
charge: 0
multiplicity: 1
frequency: 0.00 0.00 0.00 0.00 0.00 0.00 15.45 22.18 29.07 31.20 34.57 43.49 54.13 57.32 66.71 69.64 71.42 77.84 89.39 93.51 95.81 100.21 102.80 108.32 110.77 116.60 124.68 125.77 136.27 150.90 153.44 155.55 161.87 168.07 173.91 179.87 183.79 187.59 189.24 190.71 197.16 204.47 213.49 220.03 236.97 250.73 261.57 276.56 290.77 302.30 313.67 322.22 335.53 361.49 367.32 397.58 417.47 422.41 424.50 433.36 451.90 467.22 497.24 508.69 547.61 550.80 582.84 604.74 612.75 632.05 648.39 658.64 669.79 699.59 701.89 702.57 709.25 722.36 726.18 733.04 737.60 741.05 746.11 757.86 767.50 796.50 796.80 798.56 839.76 852.64 873.61 877.71 893.01 896.26 901.60 954.42 973.18 976.29 990.09 1044.31 1047.75 1056.18 1057.93 1059.90 1070.79 1071.82 1112.03 1116.39 1120.45 1130.91 1144.50 1152.73 1180.62 1201.56 1241.47 1242.91 1251.82 1267.44 1280.18 1287.59 1299.59 1324.30 1336.87 1353.49 1359.12 1375.18 1377.61 1380.71 1382.77 1393.81 1395.62 1397.40 1400.45 1407.05 1411.41 1412.38 1415.60 1420.98 1425.03 1452.93 1471.80 1473.45 1474.54 1483.59 1498.83 1501.86 1502.69 1555.08 1570.13 1594.92 1615.85 1622.93 1629.82 2277.55 2277.95 2977.91 2978.29 2981.41 2982.05 3063.62 3065.39 3069.06 3069.69 3109.60 3114.09 3120.13 3121.90 3129.93 3141.13 3168.65 3176.80
frequency: 15.45 22.18 29.07 31.20 34.57 43.49 54.13 57.32 66.71 69.64 71.42 77.84 89.39 93.51 95.81 100.21 102.80 108.32 110.77 116.60 124.68 125.77 136.27 150.90 153.44 155.55 161.87 168.07 173.91 179.87 183.79 187.59 189.24 190.71 197.16 204.47 213.49 220.03 236.97 250.73 261.57 276.56 290.77 302.30 313.67 322.22 335.53 361.49 367.32 397.58 417.47 422.41 424.50 433.36 451.90 467.22 497.24 508.69 547.61 550.80 582.84 604.74 612.75 632.05 648.39 658.64 669.79 699.59 701.89 702.57 709.25 722.36 726.18 733.04 737.60 741.05 746.11 757.86 767.50 796.50 796.80 798.56 839.76 852.64 873.61 877.71 893.01 896.26 901.60 954.42 973.18 976.29 990.09 1044.31 1047.75 1056.18 1057.93 1059.90 1070.79 1071.82 1112.03 1116.39 1120.45 1130.91 1144.50 1152.73 1180.62 1201.56 1241.47 1242.91 1251.82 1267.44 1280.18 1287.59 1299.59 1324.30 1336.87 1353.49 1359.12 1375.18 1377.61 1380.71 1382.77 1393.81 1395.62 1397.40 1400.45 1407.05 1411.41 1412.38 1415.60 1420.98 1425.03 1452.93 1471.80 1473.45 1474.54 1483.59 1498.83 1501.86 1502.69 1555.08 1570.13 1594.92 1615.85 1622.93 1629.82 2277.55 2277.95 2977.91 2978.29 2981.41 2982.05 3063.62 3065.39 3069.06 3069.69 3109.60 3114.09 3120.13 3121.90 3129.93 3141.13 3168.65 3176.80
formula: C20H16N9O11Yb
InChI: InChI=1/C20H16N6O2.3NO3.Yb/c1-25(2)19(27)15-7-11(9-21)13-5-6-14-12(10-22)8-16(20(28)26(3)4)24-18(14)17(13)23-15;3*2-1(3)4;/h5-8H,1-4H3;;;;/q-4;3*-2;+10/rC20H16N9O11Yb/c1-23(2)19-15-7-11(9-21)13-5-6-14-12(10-22)8-16-20(24(3)4)34-41(33-19,27(30,35-41)36-41,28(31,37-41)38-41,29(32,39-41)40-41)25(15)17(13)18(14)26(16)41/h5-8H,1-4H3
57 atoms
C  -0.462126 -0.44407 -4.058709
C  -0.556914 0.935887 -4.277185
C  -0.433955 -0.959685 -2.726094
C  -0.655648 1.79858 -3.163458
C  -0.511651 0.006832 -1.68153
N  -0.633223 1.328407 -1.91081
C  -0.289563 -2.347257 -2.391369
C  -0.172119 -2.752985 -1.080807
C  -0.18989 -1.799825 -0.009317
C  -0.385441 -0.41986 -0.304023
H  -0.516734 1.32616 -5.298833
H  -0.254955 -3.090637 -3.198907
H  -0.044339 -3.818363 -0.847947
C  0.020372 -2.117243 1.368324
N  -0.4082 0.537311 0.63918
C  -0.259272 0.224434 1.929337
C  -0.007277 -1.106211 2.336911
H  0.200647 -1.359391 3.38035
C  -0.602249 3.308841 -3.197863
O  -0.06743 3.861774 -2.193098
C  -0.263234 1.461045 2.799484
O  -0.008611 2.55109 2.209255
N  -1.066522 4.01223 -4.237276
N  -0.508854 1.415405 4.115864
C  -1.944679 3.489756 -5.283325
H  -1.392385 3.352737 -6.23285
H  -2.413275 2.544791 -4.970229
H  -2.748377 4.228991 -5.447954
C  -0.843083 5.456853 -4.26489
H  0.046204 5.709259 -3.668004
H  -0.696799 5.764822 -5.314631
H  -1.725359 5.985756 -3.854313
C  -1.088987 0.281315 4.834787
H  -1.645195 -0.379451 4.15243
H  -0.309472 -0.288462 5.376532
H  -1.804256 0.682951 5.573422
C  -0.335196 2.63486 4.905057
H  -1.311052 3.139013 5.046676
H  0.068695 2.352355 5.893093
H  0.359016 3.316509 4.39182
Yb -0.586861 3.00399 -0.035824
N  2.289221 3.243984 0.014126
O  3.514774 3.34787 0.044658
O  1.515674 4.205416 0.34998
O  1.709016 2.165442 -0.35663
N  -3.398194 2.515115 -0.656023
O  -4.589896 2.350712 -0.917351
O  -2.696974 3.417413 -1.235487
O  -2.783344 1.799674 0.202773
N  -1.881806 5.410141 0.98592
O  -2.448096 6.429593 1.385085
O  -2.145302 4.255411 1.465044
O  -0.995642 5.442093 0.065207
C  -0.356666 -1.334187 -5.17771
N  -0.274893 -2.068599 -6.086823
C  0.282113 -3.470775 1.761655
N  0.492525 -4.580205 2.073982
elementType: C N H O Yb
totalener: -2127.79938274 hartree
nucrepener: 5290.04811291 hartree
electener: -7417.84749566 hartree
twoeener: 6034.76569635 hartree
cpcmener: -0.09728907 hartree
kineticenergy: 2081.01479425 hartree
exchangeener: -263.003428283683 hartree
correlationener: -10.189748651418 hartree
xcener: -273.193176935101 hartree
chargesum: -0.0000000
charge: 0.081150 -0.057694 -0.309113 -0.160767 -0.215341 0.129273 -0.499438 -0.559416 -0.365939 0.081838 -0.108587 0.717783 0.732555 0.046494 -0.156290 -0.078632 -0.091068 -0.111349 0.865544 -0.880680 0.919315 -1.042097 -1.427918 -1.356654 0.916456 0.136252 -0.023343 -0.179951 1.045582 -0.105005 -0.079004 0.067285 0.857339 0.040955 0.155535 -0.229138 1.019971 0.043140 -0.028309 -0.126382 2.761065 0.566633 -0.431925 -0.549291 -0.529683 0.551285 -0.445513 -0.494415 -0.513750 0.568271 -0.450508 -0.534413 -0.515398 0.286593 -0.105858 0.279238 -0.106685
charge: -0.097348 0.156297 -0.029193 0.009921 0.017013 -0.021185 0.102407 0.102375 -0.028907 0.010785 0.041637 0.036756 0.036628 -0.098891 -0.031251 0.016515 0.156803 0.035875 -0.036058 -0.293765 -0.004191 -0.298193 -0.195040 -0.197045 0.247173 0.028589 0.008801 0.024296 0.254971 0.006284 0.023525 0.032711 0.245942 0.010271 0.028844 0.022643 0.253272 0.032123 0.024488 0.004609 1.507566 -0.363620 -0.032556 -0.166536 -0.166888 -0.358163 -0.034600 -0.160026 -0.163154 -0.366880 -0.042516 -0.155352 -0.164616 -0.053538 0.068596 -0.055176 0.066973
qa: 0.0812 -0.0577 -0.3091 -0.1608 -0.2153 0.1293 -0.4994 -0.5594 -0.3659 0.0818 -0.1086 0.7178 0.7326 0.0465 -0.1563 -0.0786 -0.0911 -0.1113 0.8655 -0.8807 0.9193 -1.0421 -1.4279 -1.3567 0.9165 0.1363 -0.0233 -0.1800 1.0456 -0.1050 -0.0790 0.0673 0.8573 0.0410 0.1555 -0.2291 1.0200 0.0431 -0.0283 -0.1264 2.7611 0.5666 -0.4319 -0.5493 -0.5297 0.5513 -0.4455 -0.4944 -0.5137 0.5683 -0.4505 -0.5344 -0.5154 0.2866 -0.1059 0.2792 -0.1067
va: 4.5611 4.3318 4.8836 4.3413 5.2014 4.7841 4.8607 4.8021 5.0660 4.8622 1.5062 0.8926 0.8830 4.3943 5.0024 4.2327 4.4775 1.5924 3.0842 1.5522 2.7625 1.6602 5.5478 5.4316 3.7552 0.8074 1.0482 0.9383 3.5879 1.1020 0.9060 0.8382 3.8086 0.9823 0.8096 0.9795 3.5858 0.8647 0.8991 1.1341 0.2218 4.0455 1.7852 1.4555 1.4130 4.1058 1.7908 1.1891 1.4446 4.0560 1.7824 1.3205 1.4117 4.0396 2.5350 4.0548 2.5351
dispersion: -0.089390927 hartree
energy: -2127.888773671629 hartree
dipole: -7.11328 7.08683 -0.02646 -158.59968 153.58360 -5.01608 -48.04992 47.03640 -1.01352
magnitude: 5.11752 au
magnitude: 13.00770 debye
temp: 298.15 k
press: 1.00 atm
zeropoint: 0.37407959 hartree
thermalvibcorrection: 0.03796537 hartree
thermalrotcorrection: 0.00141627 hartree
thermaltrasncorrection: 0.00141627 hartree
thermaltotal: -2127.47389617 hartree
thermalcorr: 0.04079792 hartree
nonthermalcorr: 0.37407959 hartree
totalcorr: 0.41487750 hartree
thermalcorrenthalpy: 0.00094421 hartree
totalenthalpy: -2127.47295196 hartree
vibrat: 0.07026839 hartree
rotat: 0.01791808 hartree
transl: 0.02168940 hartree
total: 0.10987588 hartree
totalentropycorr: -0.10987588 hartree
gibbsenthalpy: -2127.58282784 hartree
gibbsminuselec: 0.30594584 hartree
