program: Orca
programVersion: 5.0.4
elementType: C C C C C N C C C C H H H C N C C H C O C O N N C H H H C H H H C H H H C H H H Tm N O O O N O O O N O O O C N C N
elementType: Tm
keywords: def2-SVPD def2/JK def2/J def2-SVPD/C PBE rijcosx rhf hcore XYZFile VeryTightSCF freq cpcm(water) D3 defgrid3
charge: 0
multiplicity: 1
frequency: 0.00 0.00 0.00 0.00 0.00 0.00 11.55 20.71 28.24 30.91 34.35 42.76 53.27 56.36 67.82 69.68 72.33 76.62 88.39 93.79 95.98 99.79 102.17 107.42 109.40 116.08 123.38 125.00 135.14 149.00 152.02 155.30 163.12 168.30 172.90 178.72 182.61 186.31 188.85 190.85 196.62 203.39 212.50 220.57 236.85 249.44 261.01 275.67 289.59 301.80 313.35 322.12 335.21 361.27 367.00 397.00 416.27 421.55 423.84 432.54 451.82 467.33 496.04 507.65 547.80 551.39 582.40 604.12 612.87 632.62 648.06 658.22 669.59 699.89 702.10 702.71 708.97 722.09 726.26 733.03 737.10 740.41 745.45 757.66 767.13 796.76 797.02 798.61 839.70 852.09 873.47 877.54 891.10 896.21 901.69 954.39 973.33 976.29 990.05 1044.02 1047.75 1055.85 1057.60 1059.54 1070.71 1071.80 1111.38 1116.36 1120.62 1130.79 1144.56 1151.93 1179.52 1200.76 1241.04 1242.84 1251.66 1267.64 1279.31 1286.74 1298.35 1324.17 1337.13 1353.59 1358.91 1375.25 1377.56 1380.91 1383.19 1393.80 1395.54 1397.00 1400.29 1406.56 1411.42 1412.39 1415.54 1420.93 1425.06 1453.03 1471.21 1473.56 1474.74 1482.83 1498.16 1502.00 1502.85 1555.28 1570.33 1594.84 1615.81 1622.89 1629.99 2277.55 2277.93 2978.05 2978.56 2981.53 2982.26 3062.93 3065.43 3068.71 3069.47 3109.60 3113.28 3120.07 3122.05 3130.05 3141.22 3167.08 3175.77
frequency: 11.55 20.71 28.24 30.91 34.35 42.76 53.27 56.36 67.82 69.68 72.33 76.62 88.39 93.79 95.98 99.79 102.17 107.42 109.40 116.08 123.38 125.00 135.14 149.00 152.02 155.30 163.12 168.30 172.90 178.72 182.61 186.31 188.85 190.85 196.62 203.39 212.50 220.57 236.85 249.44 261.01 275.67 289.59 301.80 313.35 322.12 335.21 361.27 367.00 397.00 416.27 421.55 423.84 432.54 451.82 467.33 496.04 507.65 547.80 551.39 582.40 604.12 612.87 632.62 648.06 658.22 669.59 699.89 702.10 702.71 708.97 722.09 726.26 733.03 737.10 740.41 745.45 757.66 767.13 796.76 797.02 798.61 839.70 852.09 873.47 877.54 891.10 896.21 901.69 954.39 973.33 976.29 990.05 1044.02 1047.75 1055.85 1057.60 1059.54 1070.71 1071.80 1111.38 1116.36 1120.62 1130.79 1144.56 1151.93 1179.52 1200.76 1241.04 1242.84 1251.66 1267.64 1279.31 1286.74 1298.35 1324.17 1337.13 1353.59 1358.91 1375.25 1377.56 1380.91 1383.19 1393.80 1395.54 1397.00 1400.29 1406.56 1411.42 1412.39 1415.54 1420.93 1425.06 1453.03 1471.21 1473.56 1474.74 1482.83 1498.16 1502.00 1502.85 1555.28 1570.33 1594.84 1615.81 1622.89 1629.99 2277.55 2277.93 2978.05 2978.56 2981.53 2982.26 3062.93 3065.43 3068.71 3069.47 3109.60 3113.28 3120.07 3122.05 3130.05 3141.22 3167.08 3175.77
formula: C20H16N9O11Tm
InChI: InChI=1/C20H16N6O2.3NO3.Tm/c1-25(2)19(27)15-7-11(9-21)13-5-6-14-12(10-22)8-16(20(28)26(3)4)24-18(14)17(13)23-15;3*2-1(3)4;/h5-8H,1-4H3;;;;/q-4;3*-2;+10/rC20H16N9O11Tm/c1-23(2)19-15-7-11(9-21)13-5-6-14-12(10-22)8-16-20(24(3)4)34-41(33-19,35-27(30)36-41,37-28(31)38-41,39-29(32)40-41)25(15)17(13)18(14)26(16)41/h5-8H,1-4H3
57 atoms
C  -0.451544 -0.436928 -4.05756
C  -0.549106 0.942728 -4.27683
C  -0.423182 -0.952066 -2.724676
C  -0.648318 1.805128 -3.163094
C  -0.501006 0.014705 -1.680156
N  -0.622994 1.335882 -1.910461
C  -0.279142 -2.339547 -2.389745
C  -0.164443 -2.745159 -1.078884
C  -0.184509 -1.792116 -0.007439
C  -0.377051 -0.411616 -0.302329
H  -0.510077 1.333503 -5.298542
H  -0.243198 -3.083074 -3.197079
H  -0.037973 -3.810633 -0.845768
C  0.020225 -2.110714 1.370778
N  -0.400757 0.545182 0.641385
C  -0.25722 0.230939 1.931671
C  -0.009811 -1.100266 2.339776
H  0.192786 -1.353668 3.3843
C  -0.600092 3.315198 -3.200663
O  -0.049382 3.871755 -2.206483
C  -0.261433 1.46534 2.804674
O  0.00886 2.555238 2.221183
N  -1.08682 4.013138 -4.23315
N  -0.523846 1.416618 4.117599
C  -1.984634 3.483105 -5.258486
H  -1.45445 3.353882 -6.22151
H  -2.435536 2.532477 -4.93656
H  -2.800114 4.213948 -5.402092
C  -0.871343 5.458711 -4.270016
H  0.026292 5.71793 -3.688773
H  -0.743972 5.76341 -5.323224
H  -1.749306 5.984954 -3.847037
C  -1.122292 0.284463 4.824379
H  -1.670683 -0.371858 4.131503
H  -0.355666 -0.290766 5.378519
H  -1.847892 0.688867 5.551443
C  -0.351334 2.631562 4.913938
H  -1.325333 3.141666 5.046505
H  0.039199 2.342236 5.905385
H  0.353157 3.310813 4.411693
Tm -0.567394 3.019198 -0.033203
N  2.320711 3.246393 0.011842
O  3.546872 3.34477 0.038852
O  1.552855 4.212038 0.348366
O  1.735291 2.169445 -0.355862
N  -3.389622 2.54098 -0.656069
O  -4.581369 2.379421 -0.919023
O  -2.685291 3.440378 -1.236291
O  -2.778587 1.825022 0.205143
N  -1.852755 5.443551 0.98878
O  -2.414506 6.46613 1.386639
O  -2.122208 4.290926 1.470002
O  -0.966241 5.471092 0.068321
C  -0.345548 -1.327811 -5.175944
N  -0.263515 -2.062673 -6.084672
C  0.278611 -3.464941 1.764072
N  0.485962 -4.57492 2.076486
elementType: C N H O Tm
totalener: -2127.21807811 hartree
nucrepener: 5283.99401870 hartree
electener: -7411.21209681 hartree
twoeener: 6028.30256262 hartree
cpcmener: -0.09734447 hartree
kineticenergy: 2080.71490914 hartree
exchangeener: -262.943050555555 hartree
correlationener: -10.187533006374 hartree
xcener: -273.130583561929 hartree
chargesum: -0.0000000
charge: 0.080510 -0.054764 -0.311914 -0.157598 -0.233498 0.132696 -0.503716 -0.554921 -0.370992 0.076972 -0.102408 0.723673 0.741356 0.045666 -0.152409 -0.086400 -0.084167 -0.109053 0.846447 -0.882929 0.911341 -1.043821 -1.439449 -1.362284 0.925483 0.128496 -0.029472 -0.169811 1.052916 -0.106714 -0.078701 0.065820 0.860007 0.037562 0.153123 -0.225657 1.021670 0.043432 -0.030033 -0.127016 2.850157 0.565954 -0.432281 -0.561128 -0.542347 0.548856 -0.444901 -0.505015 -0.517936 0.564927 -0.449400 -0.540778 -0.521625 0.286286 -0.103252 0.277408 -0.104368
charge: -0.097675 0.155858 -0.029286 0.009238 0.017480 -0.021399 0.102126 0.102074 -0.029076 0.011601 0.042847 0.036669 0.036537 -0.099119 -0.030689 0.016273 0.156363 0.036327 -0.037779 -0.292315 -0.004790 -0.297523 -0.195284 -0.197176 0.246821 0.028194 0.008634 0.024272 0.254659 0.006294 0.023389 0.032411 0.245422 0.010186 0.028638 0.022594 0.252875 0.031958 0.024351 0.004580 1.507180 -0.363895 -0.032362 -0.165613 -0.166278 -0.357889 -0.034394 -0.159486 -0.162243 -0.367355 -0.042748 -0.154819 -0.163350 -0.053742 0.068626 -0.055265 0.067069
qa: 0.0805 -0.0548 -0.3119 -0.1576 -0.2335 0.1327 -0.5037 -0.5549 -0.3710 0.0770 -0.1024 0.7237 0.7414 0.0457 -0.1524 -0.0864 -0.0842 -0.1091 0.8464 -0.8829 0.9113 -1.0438 -1.4394 -1.3623 0.9255 0.1285 -0.0295 -0.1698 1.0529 -0.1067 -0.0787 0.0658 0.8600 0.0376 0.1531 -0.2257 1.0217 0.0434 -0.0300 -0.1270 2.8502 0.5660 -0.4323 -0.5611 -0.5423 0.5489 -0.4449 -0.5050 -0.5179 0.5649 -0.4494 -0.5408 -0.5216 0.2863 -0.1033 0.2774 -0.1044
va: 4.5868 4.3173 4.8788 4.3535 5.2392 4.7947 4.8647 4.8058 5.0612 4.8782 1.4966 0.8826 0.8691 4.4110 4.9877 4.2559 4.4694 1.5830 3.1280 1.5643 2.7902 1.6848 5.5628 5.4382 3.7475 0.8121 1.0565 0.9329 3.5864 1.1016 0.9051 0.8379 3.8061 0.9878 0.8109 0.9775 3.5879 0.8635 0.8992 1.1304 0.0295 4.0473 1.7867 1.4430 1.4186 4.1030 1.7911 1.1866 1.4456 4.0600 1.7798 1.3195 1.4114 4.0422 2.5386 4.0575 2.5388
dispersion: -0.089215219 hartree
energy: -2127.307293333211 hartree
dipole: -8.86788 8.72783 -0.14004 -155.76759 150.69236 -5.07523 -47.04108 46.04538 -0.99570
magnitude: 5.17387 au
magnitude: 13.15094 debye
temp: 298.15 k
press: 1.00 atm
zeropoint: 0.37395380 hartree
thermalvibcorrection: 0.03802760 hartree
thermalrotcorrection: 0.00141627 hartree
thermaltrasncorrection: 0.00141627 hartree
thermaltotal: -2126.89247940 hartree
thermalcorr: 0.04086014 hartree
nonthermalcorr: 0.37395380 hartree
totalcorr: 0.41481394 hartree
thermalcorrenthalpy: 0.00094421 hartree
totalenthalpy: -2126.89153519 hartree
vibrat: 0.07057698 hartree
rotat: 0.01792054 hartree
transl: 0.02168143 hartree
total: 0.11017895 hartree
totalentropycorr: -0.11017895 hartree
gibbsenthalpy: -2127.00171414 hartree
gibbsminuselec: 0.30557919 hartree
