program: Orca
programVersion: 5.0.4
elementType: C C C C C N C C C C H H H C N C C H C O C O N N C H H H C H H H C H H H C H H H Eu N O O O N O O O N O O O C F F F C F F F
elementType: Eu
keywords: def2-SVPD def2/JK def2/J def2-SVPD/C PBE rijcosx rhf hcore XYZFile VeryTightSCF freq cpcm(water) D3 defgrid3
charge: 0
multiplicity: 1
frequency: 0.00 0.00 0.00 0.00 0.00 0.00 17.31 20.64 26.38 29.07 34.71 39.90 41.12 47.36 48.56 49.53 61.75 71.79 74.33 78.37 84.84 88.56 90.74 93.84 94.47 103.16 106.78 110.62 114.21 121.74 125.71 132.60 145.86 149.85 160.61 164.12 168.96 171.14 177.50 181.58 184.00 187.62 196.49 202.99 206.76 216.02 225.09 233.47 250.58 256.68 279.39 282.92 291.39 294.16 306.64 318.22 334.29 337.91 354.38 363.34 376.02 397.76 420.61 435.00 471.16 475.60 489.44 497.63 507.81 517.10 556.93 562.30 581.32 602.19 612.65 626.78 637.82 644.41 661.58 681.86 690.83 701.91 703.62 703.72 714.34 726.07 728.57 731.67 732.95 736.37 740.78 758.47 764.21 797.82 798.06 799.46 834.13 836.20 863.56 870.80 879.36 891.70 901.33 903.78 947.70 982.65 983.65 1035.49 1036.30 1044.89 1047.43 1051.94 1054.92 1056.86 1071.03 1072.28 1076.85 1078.92 1081.16 1099.76 1117.44 1119.67 1138.38 1140.90 1182.89 1192.03 1194.36 1207.66 1243.81 1244.27 1253.31 1271.15 1279.58 1282.86 1289.60 1332.16 1353.83 1357.51 1375.50 1376.44 1378.15 1381.38 1384.44 1393.19 1395.31 1396.05 1399.96 1403.95 1412.19 1413.17 1417.19 1422.20 1425.14 1452.14 1466.35 1475.79 1476.58 1479.53 1494.01 1505.60 1511.45 1565.83 1588.16 1608.87 1618.25 1623.93 1626.92 2977.95 2978.70 2981.45 2982.40 3061.60 3064.48 3067.82 3068.54 3110.39 3110.98 3120.96 3122.78 3156.88 3166.62 3175.19 3180.05
frequency: 17.31 20.64 26.38 29.07 34.71 39.90 41.12 47.36 48.56 49.53 61.75 71.79 74.33 78.37 84.84 88.56 90.74 93.84 94.47 103.16 106.78 110.62 114.21 121.74 125.71 132.60 145.86 149.85 160.61 164.12 168.96 171.14 177.50 181.58 184.00 187.62 196.49 202.99 206.76 216.02 225.09 233.47 250.58 256.68 279.39 282.92 291.39 294.16 306.64 318.22 334.29 337.91 354.38 363.34 376.02 397.76 420.61 435.00 471.16 475.60 489.44 497.63 507.81 517.10 556.93 562.30 581.32 602.19 612.65 626.78 637.82 644.41 661.58 681.86 690.83 701.91 703.62 703.72 714.34 726.07 728.57 731.67 732.95 736.37 740.78 758.47 764.21 797.82 798.06 799.46 834.13 836.20 863.56 870.80 879.36 891.70 901.33 903.78 947.70 982.65 983.65 1035.49 1036.30 1044.89 1047.43 1051.94 1054.92 1056.86 1071.03 1072.28 1076.85 1078.92 1081.16 1099.76 1117.44 1119.67 1138.38 1140.90 1182.89 1192.03 1194.36 1207.66 1243.81 1244.27 1253.31 1271.15 1279.58 1282.86 1289.60 1332.16 1353.83 1357.51 1375.50 1376.44 1378.15 1381.38 1384.44 1393.19 1395.31 1396.05 1399.96 1403.95 1412.19 1413.17 1417.19 1422.20 1425.14 1452.14 1466.35 1475.79 1476.58 1479.53 1494.01 1505.60 1511.45 1565.83 1588.16 1608.87 1618.25 1623.93 1626.92 2977.95 2978.70 2981.45 2982.40 3061.60 3064.48 3067.82 3068.54 3110.39 3110.98 3120.96 3122.78 3156.88 3166.62 3175.19 3180.05
formula: C20H16EuF6N7O11
InChI: InChI=1/C20H16F6N4O2.Eu.3NO3/c1-29(2)17(31)13-7-11(19(21,22)23)9-5-6-10-12(20(24,25)26)8-14(18(32)30(3)4)28-16(10)15(9)27-13;;3*2-1(3)4/h5-8H,1-4H3;;;;/q-4;+10;3*-2/rC20H16EuF6N7O11/c1-28(2)17-13-7-11(19(22,23)24)9-5-6-10-12(20(25,26)27)8-14-18(29(3)4)39-21(38-17,32(35,40-21)41-21,33(36,42-21)43-21,34(37,44-21)45-21)30(13)15(9)16(10)31(14)21/h5-8H,1-4H3
61 atoms
C  -0.4202 -0.439644 -4.07215
C  -0.526023 0.929263 -4.287973
C  -0.374309 -0.954865 -2.742972
C  -0.612646 1.795257 -3.174098
C  -0.437836 0.010156 -1.691595
N  -0.562395 1.333457 -1.922125
C  -0.237335 -2.34278 -2.395682
C  -0.122373 -2.747297 -1.086211
C  -0.135626 -1.799663 -0.006126
C  -0.316994 -0.416175 -0.310201
H  -0.510777 1.327391 -5.306928
H  -0.211046 -3.102155 -3.18474
H  -0.009117 -3.815929 -0.873649
C  0.054407 -2.116083 1.371494
N  -0.349357 0.54312 0.634978
C  -0.231155 0.221336 1.924091
C  0.010136 -1.112413 2.3316
H  0.193587 -1.357037 3.381014
C  -0.588904 3.304153 -3.239068
O  0.022263 3.890753 -2.298597
C  -0.257044 1.434265 2.824579
O  0.076113 2.534267 2.294158
N  -1.167945 3.971562 -4.244313
N  -0.608264 1.352017 4.115513
C  -2.124759 3.401733 -5.192357
H  -1.664829 3.277491 -6.191357
H  -2.520016 2.440547 -4.830513
H  -2.971467 4.105526 -5.281029
C  -0.992773 5.420784 -4.32171
H  -0.06771 5.712838 -3.802573
H  -0.939659 5.708325 -5.386159
H  -1.855911 5.933166 -3.853557
C  -1.278427 0.213456 4.744236
H  -1.780995 -0.416315 3.994449
H  -0.566334 -0.388773 5.340605
H  -2.051412 0.61348 5.423435
C  -0.466123 2.536714 4.961169
H  -1.440942 3.053076 5.059088
H  -0.133102 2.209887 5.962015
H  0.270933 3.224705 4.521373
Eu -0.456529 3.0978 -0.018414
N  2.509089 3.248393 0.034945
O  3.73739 3.310715 0.073909
O  1.770689 4.239291 0.370464
O  1.898531 2.189385 -0.343865
N  -3.367402 2.663676 -0.550009
O  -4.570811 2.516257 -0.764935
O  -2.66387 3.505925 -1.211147
O  -2.750125 1.986071 0.339129
N  -1.647852 5.685173 0.925739
O  -2.171314 6.741745 1.287258
O  -1.92747 4.569438 1.485403
O  -0.798509 5.64407 -0.027727
C  -0.335192 -1.374164 -5.266667
F  -0.366075 -0.707828 -6.440728
F  0.811573 -2.105025 -5.247323
F  -1.373732 -2.253318 -5.273369
C  0.320759 -3.54656 1.805766
F  0.494793 -3.652201 3.141146
F  -0.713205 -4.364188 1.467685
F  1.438503 -4.045154 1.212501
elementType: C N H O Eu F
totalener: -2612.55401342 hartree
nucrepener: 6414.66204882 hartree
electener: -9027.21606223 hartree
twoeener: 7352.02488998 hartree
cpcmener: -0.08681329 hartree
kineticenergy: 2564.94898420 hartree
exchangeener: -309.663240758055 hartree
correlationener: -11.644980034198 hartree
xcener: -321.308220792253 hartree
chargesum: 0.0000000
charge: -0.149899 -0.127524 -0.321716 -0.203738 -0.422742 0.001915 -0.625470 -0.617723 -0.423882 -0.079760 -0.127481 0.945064 1.010747 -0.178083 -0.166120 -0.167450 -0.197702 -0.141530 0.883839 -1.140594 0.887551 -1.150018 -1.488471 -1.384451 0.939322 0.122452 0.021387 -0.181763 1.067312 -0.109548 -0.069827 0.067831 0.872285 0.092650 0.156945 -0.251013 1.025168 0.045017 -0.034230 -0.126941 4.012874 0.551423 -0.421592 -0.617055 -0.652295 0.534195 -0.434567 -0.587464 -0.583075 0.560003 -0.444118 -0.625214 -0.574720 1.790139 -0.415392 -0.424843 -0.435156 1.791867 -0.419170 -0.434162 -0.423487
charge: 0.017990 0.163917 -0.010163 0.002495 0.015584 -0.027096 0.102490 0.102835 -0.009998 0.011393 0.035383 0.030421 0.030910 0.016689 -0.032008 0.008466 0.163336 0.027369 -0.046464 -0.305880 -0.013792 -0.312414 -0.197137 -0.198798 0.246052 0.027461 0.009548 0.023515 0.252566 0.004830 0.022883 0.031079 0.244893 0.011376 0.028131 0.022146 0.250859 0.030999 0.024053 0.003032 1.688059 -0.371920 -0.036486 -0.174998 -0.177094 -0.364321 -0.038665 -0.169929 -0.173645 -0.375811 -0.048262 -0.168024 -0.170062 0.047199 -0.051081 -0.054686 -0.054742 0.047282 -0.051526 -0.055489 -0.054746
qa: -0.1499 -0.1275 -0.3217 -0.2037 -0.4227 0.0019 -0.6255 -0.6177 -0.4239 -0.0798 -0.1275 0.9451 1.0107 -0.1781 -0.1661 -0.1674 -0.1977 -0.1415 0.8838 -1.1406 0.8876 -1.1500 -1.4885 -1.3845 0.9393 0.1225 0.0214 -0.1818 1.0673 -0.1095 -0.0698 0.0678 0.8723 0.0927 0.1569 -0.2510 1.0252 0.0450 -0.0342 -0.1269 4.0129 0.5514 -0.4216 -0.6171 -0.6523 0.5342 -0.4346 -0.5875 -0.5831 0.5600 -0.4441 -0.6252 -0.5747 1.7901 -0.4154 -0.4248 -0.4352 1.7919 -0.4192 -0.4342 -0.4235
va: 4.2710 3.7751 5.2062 4.6096 5.2689 4.8036 5.1401 5.0779 5.3418 4.9025 1.4183 0.6747 0.5401 4.0408 5.0551 4.4960 3.9111 1.4852 3.2089 1.4560 2.9441 1.4715 5.6105 5.4578 3.7361 0.8190 1.0227 0.9181 3.5647 1.1172 0.9040 0.8414 3.7962 0.9459 0.8050 0.9569 3.5813 0.8550 0.9006 1.1382 -2.7745 4.0501 1.7941 1.5429 1.5973 4.0920 1.7975 1.2270 1.5124 4.0527 1.7754 1.4107 1.4742 3.0293 0.7338 0.8292 0.8374 3.0329 0.7366 0.8330 0.8273
dispersion: -0.091840344 hartree
energy: -2612.645853761916 hartree
dipole: -13.58488 13.09494 -0.48994 -177.06872 170.25147 -6.81725 -52.92135 51.45254 -1.46880
magnitude: 6.99087 au
magnitude: 17.76939 debye
temp: 298.15 k
press: 1.00 atm
zeropoint: 0.38463078 hartree
thermalvibcorrection: 0.04196199 hartree
thermalrotcorrection: 0.00141627 hartree
thermaltrasncorrection: 0.00141627 hartree
thermaltotal: -2612.21642844 hartree
thermalcorr: 0.04479454 hartree
nonthermalcorr: 0.38463078 hartree
totalcorr: 0.42942532 hartree
thermalcorrenthalpy: 0.00094421 hartree
totalenthalpy: -2612.21548423 hartree
vibrat: 0.07778568 hartree
rotat: 0.01834371 hartree
transl: 0.02180979 hartree
total: 0.11793918 hartree
totalentropycorr: -0.11793918 hartree
gibbsenthalpy: -2612.33342342 hartree
gibbsminuselec: 0.31243035 hartree
