program: Orca
programVersion: 5.0.4
elementType: C C C C C N C C C C H H H C N C C H C O C O N N C H H H C H H H C H H H C H H H Gd N O O O N O O O N O O O F F
elementType: Gd
keywords: def2-SVPD def2/JK def2/J def2-SVPD/C PBE rijcosx rhf hcore XYZFile VeryTightSCF freq cpcm(water) D3 defgrid3
charge: 0
multiplicity: 1
frequency: 0.00 0.00 0.00 0.00 0.00 0.00 19.10 25.84 32.61 34.45 37.41 41.87 48.24 51.70 72.07 74.85 79.87 85.05 90.36 95.25 98.99 105.37 107.69 112.40 115.95 125.11 126.49 139.99 143.18 156.93 164.65 168.66 170.20 177.04 183.49 186.44 188.85 196.64 203.10 206.71 209.81 227.98 237.89 240.50 259.75 275.21 279.13 284.31 306.19 320.64 323.45 335.82 355.60 373.86 418.71 433.64 457.25 461.38 505.25 512.61 535.53 544.52 569.55 585.97 609.65 620.99 643.94 662.49 663.41 701.65 703.47 703.53 709.64 713.51 715.42 734.15 736.03 737.44 741.77 761.19 767.14 797.97 798.16 799.55 831.51 854.32 863.38 869.60 877.92 898.46 902.37 974.73 979.06 996.90 1013.67 1045.11 1047.91 1053.30 1056.21 1058.15 1071.63 1072.77 1103.00 1115.59 1120.13 1124.25 1134.83 1148.34 1162.98 1182.57 1239.47 1242.40 1245.76 1275.04 1279.22 1284.43 1294.03 1342.19 1349.96 1361.52 1371.98 1375.49 1377.34 1382.18 1385.17 1394.22 1395.61 1398.97 1401.84 1411.58 1412.87 1414.15 1416.29 1422.72 1424.79 1453.86 1463.93 1473.59 1474.05 1476.24 1492.45 1504.56 1508.68 1557.16 1597.22 1615.16 1616.42 1619.24 1625.41 2977.36 2977.97 2980.91 2981.79 3060.52 3063.65 3066.82 3067.87 3111.34 3112.93 3120.06 3121.97 3144.37 3156.16 3165.29 3173.09
frequency: 19.10 25.84 32.61 34.45 37.41 41.87 48.24 51.70 72.07 74.85 79.87 85.05 90.36 95.25 98.99 105.37 107.69 112.40 115.95 125.11 126.49 139.99 143.18 156.93 164.65 168.66 170.20 177.04 183.49 186.44 188.85 196.64 203.10 206.71 209.81 227.98 237.89 240.50 259.75 275.21 279.13 284.31 306.19 320.64 323.45 335.82 355.60 373.86 418.71 433.64 457.25 461.38 505.25 512.61 535.53 544.52 569.55 585.97 609.65 620.99 643.94 662.49 663.41 701.65 703.47 703.53 709.64 713.51 715.42 734.15 736.03 737.44 741.77 761.19 767.14 797.97 798.16 799.55 831.51 854.32 863.38 869.60 877.92 898.46 902.37 974.73 979.06 996.90 1013.67 1045.11 1047.91 1053.30 1056.21 1058.15 1071.63 1072.77 1103.00 1115.59 1120.13 1124.25 1134.83 1148.34 1162.98 1182.57 1239.47 1242.40 1245.76 1275.04 1279.22 1284.43 1294.03 1342.19 1349.96 1361.52 1371.98 1375.49 1377.34 1382.18 1385.17 1394.22 1395.61 1398.97 1401.84 1411.58 1412.87 1414.15 1416.29 1422.72 1424.79 1453.86 1463.93 1473.59 1474.05 1476.24 1492.45 1504.56 1508.68 1557.16 1597.22 1615.16 1616.42 1619.24 1625.41 2977.36 2977.97 2980.91 2981.79 3060.52 3063.65 3066.82 3067.87 3111.34 3112.93 3120.06 3121.97 3144.37 3156.16 3165.29 3173.09
formula: C18H16F2GdN7O11
InChI: InChI=1/C18H16F2N4O2.Gd.3NO3/c1-23(2)17(25)13-7-11(19)9-5-6-10-12(20)8-14(18(26)24(3)4)22-16(10)15(9)21-13;;3*2-1(3)4/h5-8H,1-4H3;;;;/q-4;+10;3*-2/rC18H16F2GdN7O11/c1-22(2)17-13-7-11(19)9-5-6-10-12(20)8-14-18(23(3)4)33-21(32-17,34-26(29)35-21,36-27(30)37-21,38-28(31)39-21)24(13)15(9)16(10)25(14)21/h5-8H,1-4H3
55 atoms
C  -0.420762 -0.428496 -4.037732
C  -0.53081 0.931449 -4.292217
C  -0.381432 -0.94889 -2.720488
C  -0.630797 1.798948 -3.181879
C  -0.467673 0.025778 -1.682869
N  -0.598464 1.347087 -1.92203
C  -0.218723 -2.337789 -2.397304
C  -0.105955 -2.743146 -1.086886
C  -0.149514 -1.783422 -0.02101
C  -0.347883 -0.399798 -0.304636
H  -0.498883 1.296909 -5.324448
H  -0.170639 -3.07041 -3.212264
H  0.031836 -3.803726 -0.843246
C  0.035405 -2.089576 1.349624
N  -0.38471 0.552425 0.647401
C  -0.249376 0.218724 1.935167
C  -0.005694 -1.115741 2.33698
H  0.184525 -1.397516 3.37716
C  -0.602084 3.308808 -3.244272
O  -0.012258 3.891724 -2.287945
C  -0.266498 1.434069 2.834335
O  0.034727 2.53701 2.290692
N  -1.154121 3.983352 -4.26065
N  -0.574828 1.355972 4.137108
C  -2.089775 3.422641 -5.234317
H  -1.606665 3.302151 -6.222877
H  -2.494338 2.460118 -4.887301
H  -2.931998 4.129711 -5.339199
C  -0.971938 5.432256 -4.326727
H  -0.058014 5.71867 -3.785116
H  -0.892884 5.725022 -5.388186
H  -1.843409 5.946474 -3.876182
C  -1.209332 0.214292 4.795414
H  -1.734507 -0.422215 4.067231
H  -0.469277 -0.380695 5.364624
H  -1.958146 0.609289 5.504018
C  -0.419585 2.548495 4.969577
H  -1.395223 3.058375 5.091259
H  -0.055303 2.232624 5.963041
H  0.298877 3.239154 4.503985
Gd -0.503432 3.074337 -0.022482
N  2.450387 3.268553 0.047868
O  3.678035 3.349329 0.093391
O  1.695427 4.246204 0.383626
O  1.857478 2.202824 -0.338196
N  -3.40379 2.659745 -0.579077
O  -4.605374 2.514828 -0.810212
O  -2.693143 3.510301 -1.220515
O  -2.796481 1.970675 0.307176
N  -1.706292 5.645942 0.931573
O  -2.236596 6.697305 1.300634
O  -1.981996 4.524574 1.48136
O  -0.854687 5.616576 -0.019064
F  -0.314415 -1.280664 -5.066259
F  0.274556 -3.362631 1.695986
elementType: C N H O Gd F
totalener: -2138.31601092 hartree
nucrepener: 5067.48650528 hartree
electener: -7205.80251620 hartree
twoeener: 5829.07375434 hartree
cpcmener: -0.08942860 hartree
kineticenergy: 2093.78664952 hartree
exchangeener: -259.295215515137 hartree
correlationener: -9.956262975430 hartree
xcener: -269.251478490567 hartree
chargesum: -0.0000000
charge: 0.842993 -0.027343 -0.339817 -0.223337 -0.391979 -0.071320 -0.506430 -0.491158 -0.439694 -0.065340 0.045271 0.727625 0.793402 0.813918 -0.240332 -0.159248 -0.036255 -0.010148 0.843654 -1.057975 0.822744 -1.093739 -1.428183 -1.333454 0.937526 0.096074 -0.042281 -0.142760 1.052729 -0.106825 -0.072795 0.062228 0.873050 0.026665 0.132467 -0.218032 1.015073 0.040783 -0.027547 -0.131850 3.659055 0.548277 -0.430446 -0.608215 -0.627747 0.530864 -0.439942 -0.547243 -0.557967 0.559611 -0.449031 -0.595037 -0.537037 -0.483016 -0.490484
charge: 0.053307 0.161018 -0.021307 -0.006401 0.007638 -0.042965 0.097215 0.097120 -0.021012 0.003481 0.048491 0.040096 0.040197 0.052140 -0.047444 0.000898 0.160735 0.039962 -0.045044 -0.302967 -0.012756 -0.309842 -0.198874 -0.200331 0.243824 0.026196 0.006537 0.022751 0.250960 0.004253 0.022099 0.030502 0.242155 0.008459 0.026793 0.021141 0.249106 0.030426 0.023223 0.002395 1.645131 -0.371678 -0.038640 -0.173328 -0.173967 -0.364802 -0.041841 -0.167779 -0.171632 -0.375290 -0.050608 -0.166251 -0.167097 -0.092287 -0.094107
qa: 0.8430 -0.0273 -0.3398 -0.2233 -0.3920 -0.0713 -0.5064 -0.4912 -0.4397 -0.0653 0.0453 0.7276 0.7934 0.8139 -0.2403 -0.1592 -0.0363 -0.0101 0.8437 -1.0580 0.8227 -1.0937 -1.4282 -1.3335 0.9375 0.0961 -0.0423 -0.1428 1.0527 -0.1068 -0.0728 0.0622 0.8731 0.0267 0.1325 -0.2180 1.0151 0.0408 -0.0275 -0.1319 3.6591 0.5483 -0.4304 -0.6082 -0.6277 0.5309 -0.4399 -0.5472 -0.5580 0.5596 -0.4490 -0.5950 -0.5370 -0.4830 -0.4905
va: 3.5812 3.7044 4.7843 4.2197 5.3637 5.0513 5.0202 4.9377 4.9748 5.0238 1.3180 1.0497 0.9368 3.4944 5.2613 4.1969 3.8891 1.3838 3.1947 1.5355 3.0052 1.5843 5.5293 5.4211 3.7357 0.8417 1.0694 0.9234 3.5800 1.1134 0.9080 0.8511 3.7990 0.9941 0.8288 0.9712 3.5897 0.8667 0.9027 1.1382 -1.8974 4.0583 1.7885 1.4965 1.6133 4.1101 1.7885 1.1976 1.5156 4.0625 1.7688 1.3900 1.4537 1.1383 1.1488
dispersion: -0.084387174 hartree
energy: -2138.400398092404 hartree
dipole: -16.61412 16.51745 -0.09667 -126.88236 118.96754 -7.91482 -37.71978 35.90248 -1.81730
magnitude: 8.12135 au
magnitude: 20.64283 debye
temp: 298.15 k
press: 1.00 atm
zeropoint: 0.36099890 hartree
thermalvibcorrection: 0.03610606 hartree
thermalrotcorrection: 0.00141627 hartree
thermaltrasncorrection: 0.00141627 hartree
thermaltotal: -2138.00046059 hartree
thermalcorr: 0.03893860 hartree
nonthermalcorr: 0.36099890 hartree
totalcorr: 0.39993750 hartree
thermalcorrenthalpy: 0.00094421 hartree
totalenthalpy: -2137.99951638 hartree
vibrat: 0.06666400 hartree
rotat: 0.01780607 hartree
transl: 0.02163043 hartree
total: 0.10610050 hartree
totalentropycorr: -0.10610050 hartree
gibbsenthalpy: -2138.10561689 hartree
gibbsminuselec: 0.29478120 hartree
