program: Orca
programVersion: 5.0.4
elementType: C C C C C N C C C C H H H C N C C H C O C O N N C H H H C H H H C H H H C H H H Pm N O O O N O O O N O O O F F
elementType: Pm
keywords: def2-SVPD def2/JK def2/J def2-SVPD/C PBE rijcosx rhf hcore XYZFile VeryTightSCF freq cpcm(water) D3 defgrid3
charge: 0
multiplicity: 1
frequency: 0.00 0.00 0.00 0.00 0.00 0.00 17.70 24.12 31.41 32.72 37.16 40.57 45.30 48.23 70.05 73.08 78.83 81.41 83.39 93.72 95.16 102.25 105.19 106.62 108.98 119.65 122.22 130.39 136.76 154.04 162.28 168.35 169.20 177.48 182.82 187.83 189.72 199.32 201.73 204.74 208.95 225.16 237.76 239.96 259.10 275.94 279.32 282.57 303.87 321.60 322.65 335.89 355.06 372.35 418.41 432.52 455.84 460.01 504.47 511.64 534.95 545.52 568.69 584.82 609.52 621.86 644.01 661.84 663.38 702.51 703.99 704.11 709.21 713.20 716.10 731.53 734.24 736.00 739.03 761.44 766.53 798.53 798.63 799.83 832.09 856.69 864.14 872.43 878.53 898.17 901.54 975.95 978.46 996.64 1012.49 1045.31 1047.64 1051.78 1054.88 1056.50 1071.51 1072.67 1102.01 1114.77 1119.66 1123.35 1134.96 1147.98 1162.55 1182.11 1238.71 1241.92 1245.30 1271.00 1278.21 1281.28 1288.13 1341.37 1348.26 1361.01 1371.47 1375.56 1377.12 1381.46 1384.55 1393.89 1395.36 1398.24 1401.03 1411.01 1412.88 1413.40 1415.19 1422.07 1423.73 1452.21 1462.44 1472.35 1474.03 1474.42 1490.09 1504.61 1508.15 1555.82 1597.05 1613.82 1615.90 1618.52 1623.83 2977.32 2977.86 2980.85 2981.61 3060.28 3063.07 3066.68 3067.24 3111.47 3111.97 3120.74 3122.01 3144.67 3156.43 3165.65 3170.96
frequency: 17.70 24.12 31.41 32.72 37.16 40.57 45.30 48.23 70.05 73.08 78.83 81.41 83.39 93.72 95.16 102.25 105.19 106.62 108.98 119.65 122.22 130.39 136.76 154.04 162.28 168.35 169.20 177.48 182.82 187.83 189.72 199.32 201.73 204.74 208.95 225.16 237.76 239.96 259.10 275.94 279.32 282.57 303.87 321.60 322.65 335.89 355.06 372.35 418.41 432.52 455.84 460.01 504.47 511.64 534.95 545.52 568.69 584.82 609.52 621.86 644.01 661.84 663.38 702.51 703.99 704.11 709.21 713.20 716.10 731.53 734.24 736.00 739.03 761.44 766.53 798.53 798.63 799.83 832.09 856.69 864.14 872.43 878.53 898.17 901.54 975.95 978.46 996.64 1012.49 1045.31 1047.64 1051.78 1054.88 1056.50 1071.51 1072.67 1102.01 1114.77 1119.66 1123.35 1134.96 1147.98 1162.55 1182.11 1238.71 1241.92 1245.30 1271.00 1278.21 1281.28 1288.13 1341.37 1348.26 1361.01 1371.47 1375.56 1377.12 1381.46 1384.55 1393.89 1395.36 1398.24 1401.03 1411.01 1412.88 1413.40 1415.19 1422.07 1423.73 1452.21 1462.44 1472.35 1474.03 1474.42 1490.09 1504.61 1508.15 1555.82 1597.05 1613.82 1615.90 1618.52 1623.83 2977.32 2977.86 2980.85 2981.61 3060.28 3063.07 3066.68 3067.24 3111.47 3111.97 3120.74 3122.01 3144.67 3156.43 3165.65 3170.96
formula: C18H16F2N7O11Pm
InChI: InChI=1/C18H16F2N4O2.3NO3.Pm/c1-23(2)17(25)13-7-11(19)9-5-6-10-12(20)8-14(18(26)24(3)4)22-16(10)15(9)21-13;3*2-1(3)4;/h5-8H,1-4H3;;;;/q-4;3*-2;+10/rC18H16F2N7O11Pm/c1-21(2)17-13-7-11(19)9-5-6-10-12(20)8-14-18(22(3)4)32-39(31-17,33-25(28)34-39,35-26(29)36-39,37-27(30)38-39)23(13)15(9)16(10)24(14)39/h5-8H,1-4H3
55 atoms
C  -0.411409 -0.433232 -4.041216
C  -0.530494 0.924628 -4.300421
C  -0.36113 -0.94812 -2.722231
C  -0.623458 1.795542 -3.19223
C  -0.442765 0.029473 -1.685871
N  -0.576123 1.350301 -1.93033
C  -0.196358 -2.336607 -2.399976
C  -0.082088 -2.741538 -1.089915
C  -0.126794 -1.781494 -0.024812
C  -0.323306 -0.396312 -0.306196
H  -0.512464 1.287019 -5.33411
H  -0.15052 -3.069151 -3.215092
H  0.056155 -3.801874 -0.845605
C  0.052048 -2.093467 1.345276
N  -0.364852 0.552326 0.650684
C  -0.238433 0.211077 1.93782
C  0.004037 -1.124319 2.336338
H  0.186322 -1.408987 3.377321
C  -0.609174 3.305218 -3.270741
O  -0.000034 3.905716 -2.337776
C  -0.264934 1.415477 2.852128
O  0.064523 2.522966 2.335023
N  -1.195842 3.962246 -4.279514
N  -0.612316 1.320392 4.144161
C  -2.147301 3.380596 -5.225273
H  -1.685428 3.253819 -6.22317
H  -2.533984 2.417598 -4.859285
H  -2.999201 4.077597 -5.318911
C  -1.03181 5.41233 -4.366506
H  -0.110828 5.715449 -3.846518
H  -0.97742 5.69336 -5.432746
H  -1.900166 5.921795 -3.904722
C  -1.279303 0.176484 4.765807
H  -1.781981 -0.448072 4.011933
H  -0.564821 -0.430509 5.354662
H  -2.05041 0.569733 5.451269
C  -0.468027 2.49727 5.000413
H  -1.441872 3.014287 5.105221
H  -0.133317 2.161396 5.997756
H  0.268848 3.188895 4.565946
Pm -0.454081 3.122361 -0.010471
N  2.545873 3.26857 0.056488
O  3.774783 3.325802 0.106482
O  1.810451 4.262003 0.391513
O  1.935799 2.213803 -0.333061
N  -3.403963 2.724492 -0.532676
O  -4.610956 2.589207 -0.742051
O  -2.694845 3.552183 -1.204841
O  -2.793336 2.046654 0.360472
N  -1.620128 5.760247 0.92853
O  -2.128352 6.825161 1.289185
O  -1.906598 4.652182 1.500354
O  -0.782582 5.70537 -0.034178
F  0.289704 -3.368043 1.686976
F  -0.310013 -1.289542 -5.066903
elementType: C N H O Pm F
totalener: -2136.52459838 hartree
nucrepener: 5036.83527580 hartree
electener: -7173.35987418 hartree
twoeener: 5797.13652012 hartree
cpcmener: -0.08940631 hartree
kineticenergy: 2092.85983722 hartree
exchangeener: -259.099456328341 hartree
correlationener: -9.949228156948 hartree
xcener: -269.048684485290 hartree
chargesum: -0.0000000
charge: 0.852544 0.038701 -0.324234 -0.209681 -0.364622 -0.116713 -0.500991 -0.491058 -0.414760 -0.098212 0.019261 0.729161 0.789802 0.818768 -0.309820 -0.132909 0.016549 -0.025212 0.739947 -1.070500 0.778174 -1.136026 -1.424479 -1.339654 0.930135 0.095098 -0.034033 -0.140905 1.049823 -0.111352 -0.066819 0.061963 0.875303 0.022116 0.123889 -0.205810 1.019402 0.041086 -0.030399 -0.132475 3.987852 0.524762 -0.420889 -0.614370 -0.646618 0.511818 -0.438520 -0.579482 -0.579358 0.528134 -0.444992 -0.616469 -0.567789 -0.486814 -0.478325
charge: 0.052653 0.159834 -0.022313 -0.010372 0.005572 -0.045808 0.096740 0.096663 -0.022046 0.001955 0.048806 0.040070 0.040156 0.051608 -0.048738 -0.003992 0.159256 0.041184 -0.049609 -0.311837 -0.018582 -0.318042 -0.199719 -0.201400 0.243255 0.026057 0.006861 0.022544 0.250508 0.003421 0.022137 0.030170 0.241927 0.008442 0.026482 0.021179 0.248636 0.030208 0.023181 0.001799 1.772118 -0.377304 -0.040924 -0.180912 -0.182418 -0.369978 -0.044618 -0.175773 -0.180215 -0.380120 -0.052048 -0.175069 -0.175207 -0.093996 -0.092381
qa: 0.8525 0.0387 -0.3242 -0.2097 -0.3646 -0.1167 -0.5010 -0.4911 -0.4148 -0.0982 0.0193 0.7292 0.7898 0.8188 -0.3098 -0.1329 0.0165 -0.0252 0.7399 -1.0705 0.7782 -1.1360 -1.4245 -1.3397 0.9301 0.0951 -0.0340 -0.1409 1.0498 -0.1114 -0.0668 0.0620 0.8753 0.0221 0.1239 -0.2058 1.0194 0.0411 -0.0304 -0.1325 3.9879 0.5248 -0.4209 -0.6144 -0.6466 0.5118 -0.4385 -0.5795 -0.5794 0.5281 -0.4450 -0.6165 -0.5678 -0.4868 -0.4783
va: 3.5866 3.7228 4.7745 4.2475 5.3344 5.2419 5.0421 4.9463 4.9333 5.0079 1.3132 1.0405 0.9411 3.5370 5.3318 4.1894 3.9393 1.3498 3.4090 1.5187 3.1090 1.5868 5.5365 5.4389 3.7454 0.8452 1.0657 0.9268 3.5726 1.1127 0.9096 0.8568 3.7974 1.0032 0.8395 0.9651 3.5817 0.8654 0.9006 1.1390 -2.4522 4.0779 1.7831 1.5061 1.4799 4.1185 1.7813 1.1920 1.4833 4.1018 1.7668 1.3721 1.4497 1.1448 1.1310
dispersion: -0.082189438 hartree
energy: -2136.606787818821 hartree
dipole: -19.69287 19.36100 -0.33186 -120.75752 112.66694 -8.09058 -35.59138 33.73153 -1.85986
magnitude: 8.30823 au
magnitude: 21.11783 debye
temp: 298.15 k
press: 1.00 atm
zeropoint: 0.36064300 hartree
thermalvibcorrection: 0.03628870 hartree
thermalrotcorrection: 0.00141627 hartree
thermaltrasncorrection: 0.00141627 hartree
thermaltotal: -2136.20702358 hartree
thermalcorr: 0.03912124 hartree
nonthermalcorr: 0.36064300 hartree
totalcorr: 0.39976424 hartree
thermalcorrenthalpy: 0.00094421 hartree
totalenthalpy: -2136.20607937 hartree
vibrat: 0.06720030 hartree
rotat: 0.01782422 hartree
transl: 0.02160549 hartree
total: 0.10663001 hartree
totalentropycorr: -0.10663001 hartree
gibbsenthalpy: -2136.31270938 hartree
gibbsminuselec: 0.29407844 hartree
