program: Orca
programVersion: 5.0.4
elementType: C C C C C N C C C C H H H C N C C H C O C O N N C H H H C H H H C H H H C H H H Ce N O O O N O O O N O O O F F
elementType: Ce
keywords: def2-SVPD def2/JK def2/J def2-SVPD/C PBE rijcosx rhf hcore XYZFile VeryTightSCF freq cpcm(water) D3 defgrid3
charge: 0
multiplicity: 1
frequency: 0.00 0.00 0.00 0.00 0.00 0.00 14.25 19.75 29.52 31.38 33.50 39.22 41.00 43.92 67.16 69.40 73.66 78.87 80.34 88.93 91.96 98.71 99.00 101.86 104.50 111.41 116.91 122.42 129.90 143.65 158.49 165.04 167.52 173.89 178.78 184.40 187.81 191.14 197.64 201.23 205.57 221.44 237.41 239.19 257.95 275.37 279.47 280.74 301.53 321.13 322.81 335.82 354.37 370.32 416.28 428.71 453.81 458.32 503.30 510.20 534.64 547.11 567.36 583.30 609.55 624.13 644.74 660.70 663.66 703.26 704.40 704.74 708.55 713.17 716.65 728.22 730.85 734.59 736.09 762.20 766.87 799.03 799.13 800.23 832.74 859.40 865.93 873.44 879.42 898.19 901.08 976.64 978.50 996.79 1011.65 1045.39 1047.04 1050.65 1053.51 1055.14 1072.65 1072.72 1100.86 1114.31 1120.01 1122.86 1135.17 1148.24 1162.99 1182.18 1238.09 1241.97 1245.35 1267.71 1277.22 1279.53 1282.94 1340.62 1347.94 1360.80 1371.24 1375.94 1377.02 1381.83 1383.83 1393.55 1395.19 1396.97 1399.66 1409.99 1412.11 1412.59 1414.02 1421.82 1422.57 1451.55 1459.31 1468.55 1472.91 1474.62 1487.51 1505.20 1507.76 1554.94 1597.36 1613.16 1615.74 1618.27 1623.11 2977.15 2977.86 2980.66 2981.61 3059.80 3062.09 3066.21 3066.62 3111.21 3113.40 3120.73 3120.84 3144.75 3156.52 3165.22 3166.71
frequency: 14.25 19.75 29.52 31.38 33.50 39.22 41.00 43.92 67.16 69.40 73.66 78.87 80.34 88.93 91.96 98.71 99.00 101.86 104.50 111.41 116.91 122.42 129.90 143.65 158.49 165.04 167.52 173.89 178.78 184.40 187.81 191.14 197.64 201.23 205.57 221.44 237.41 239.19 257.95 275.37 279.47 280.74 301.53 321.13 322.81 335.82 354.37 370.32 416.28 428.71 453.81 458.32 503.30 510.20 534.64 547.11 567.36 583.30 609.55 624.13 644.74 660.70 663.66 703.26 704.40 704.74 708.55 713.17 716.65 728.22 730.85 734.59 736.09 762.20 766.87 799.03 799.13 800.23 832.74 859.40 865.93 873.44 879.42 898.19 901.08 976.64 978.50 996.79 1011.65 1045.39 1047.04 1050.65 1053.51 1055.14 1072.65 1072.72 1100.86 1114.31 1120.01 1122.86 1135.17 1148.24 1162.99 1182.18 1238.09 1241.97 1245.35 1267.71 1277.22 1279.53 1282.94 1340.62 1347.94 1360.80 1371.24 1375.94 1377.02 1381.83 1383.83 1393.55 1395.19 1396.97 1399.66 1409.99 1412.11 1412.59 1414.02 1421.82 1422.57 1451.55 1459.31 1468.55 1472.91 1474.62 1487.51 1505.20 1507.76 1554.94 1597.36 1613.16 1615.74 1618.27 1623.11 2977.15 2977.86 2980.66 2981.61 3059.80 3062.09 3066.21 3066.62 3111.21 3113.40 3120.73 3120.84 3144.75 3156.52 3165.22 3166.71
formula: C18H16CeF2N7O11
InChI: InChI=1/C18H16F2N4O2.Ce.3NO3/c1-23(2)17(25)13-7-11(19)9-5-6-10-12(20)8-14(18(26)24(3)4)22-16(10)15(9)21-13;;3*2-1(3)4/h5-8H,1-4H3;;;;/q-4;+10;3*-2/rC18H16CeF2N7O11/c1-22(2)17-13-7-11(20)9-5-6-10-12(21)8-14-18(23(3)4)33-19(32-17,34-26(29)35-19,36-27(30)37-19,38-28(31)39-19)24(13)15(9)16(10)25(14)19/h5-8H,1-4H3
55 atoms
C  -0.398311 -0.43601 -4.042983
C  -0.529092 0.919716 -4.305213
C  -0.331788 -0.946224 -2.722685
C  -0.610732 1.792972 -3.198083
C  -0.406452 0.033458 -1.68709
N  -0.543641 1.353741 -1.935386
C  -0.162651 -2.334184 -2.401494
C  -0.043982 -2.738938 -1.092107
C  -0.089838 -1.779175 -0.027033
C  -0.284885 -0.392913 -0.306745
H  -0.531255 1.280744 -5.33962
H  -0.119149 -3.066287 -3.217115
H  0.095587 -3.799053 -0.847617
C  0.082425 -2.096614 1.34298
N  -0.330992 0.55217 0.654427
C  -0.21466 0.203996 1.940432
C  0.026265 -1.13187 2.337462
H  0.198834 -1.41745 3.380391
C  -0.613085 3.30218 -3.291168
O  0.027553 3.920227 -2.391626
C  -0.251892 1.39734 2.868433
O  0.128807 2.503994 2.386193
N  -1.249364 3.939685 -4.282387
N  -0.666252 1.288837 4.139312
C  -2.227912 3.333016 -5.183693
H  -1.804005 3.206623 -6.198334
H  -2.580515 2.365646 -4.795539
H  -3.096032 4.013207 -5.247898
C  -1.110205 5.390552 -4.392557
H  -0.178017 5.713704 -3.905667
H  -1.0939 5.659123 -5.463365
H  -1.971511 5.892588 -3.909912
C  -1.398486 0.154297 4.701884
H  -1.843432 -0.464182 3.908172
H  -0.742516 -0.461717 5.34647
H  -2.218769 0.558203 5.321402
C  -0.539161 2.447376 5.022301
H  -1.500093 2.995807 5.073387
H  -0.280638 2.085803 6.033119
H  0.247016 3.119762 4.647762
Ce -0.379087 3.17264 0.005099
N  2.680331 3.250952 0.034692
O  3.911182 3.281108 0.067683
O  1.974396 4.263956 0.376506
O  2.043792 2.207488 -0.342258
N  -3.389008 2.788672 -0.492844
O  -4.600357 2.662273 -0.685971
O  -2.682148 3.599127 -1.187766
O  -2.777406 2.117383 0.404772
N  -1.526725 5.875319 0.947728
O  -2.018109 6.949967 1.303461
O  -1.830202 4.775997 1.527467
O  -0.691901 5.805926 -0.01744
F  -0.305188 -1.295759 -5.066541
F  0.318802 -3.372497 1.680134
elementType: C N H O Ce F
totalener: -2134.65368276 hartree
nucrepener: 5004.91575242 hartree
electener: -7139.56943518 hartree
twoeener: 5763.81310542 hartree
cpcmener: -0.08917998 hartree
kineticenergy: 2091.86493146 hartree
exchangeener: -258.893711846151 hartree
correlationener: -9.943147894109 hartree
xcener: -268.836859740260 hartree
chargesum: 0.0000000
charge: 0.844047 0.090253 -0.330429 -0.254910 -0.378180 -0.018825 -0.497763 -0.483255 -0.408823 -0.137524 0.008245 0.743759 0.806037 0.813345 -0.255041 -0.173262 0.073291 -0.016857 0.703889 -1.009241 0.731933 -1.073996 -1.432962 -1.349044 0.931197 0.088972 -0.032494 -0.132883 1.054646 -0.112260 -0.061513 0.056030 0.893162 -0.002609 0.101988 -0.175631 1.017240 0.046530 -0.038959 -0.123456 3.812029 0.503759 -0.421472 -0.614945 -0.640843 0.492193 -0.438794 -0.567078 -0.567276 0.509236 -0.443504 -0.602996 -0.563264 -0.477017 -0.484674
charge: 0.052268 0.158893 -0.022924 -0.015594 0.002686 -0.051736 0.096290 0.096241 -0.022626 -0.000476 0.049722 0.040025 0.040102 0.051264 -0.053580 -0.011039 0.157746 0.044877 -0.057029 -0.323979 -0.027992 -0.329211 -0.200663 -0.202550 0.243110 0.025931 0.006826 0.022572 0.250393 0.002888 0.022248 0.029811 0.242376 0.007186 0.026298 0.021903 0.248268 0.030214 0.022781 0.002178 1.943225 -0.384792 -0.044332 -0.192464 -0.193675 -0.376553 -0.048592 -0.186609 -0.191459 -0.387074 -0.054425 -0.186177 -0.186440 -0.092444 -0.093885
qa: 0.8440 0.0903 -0.3304 -0.2549 -0.3782 -0.0188 -0.4978 -0.4833 -0.4088 -0.1375 0.0082 0.7438 0.8060 0.8133 -0.2550 -0.1733 0.0733 -0.0169 0.7039 -1.0092 0.7319 -1.0740 -1.4330 -1.3490 0.9312 0.0890 -0.0325 -0.1329 1.0546 -0.1123 -0.0615 0.0560 0.8932 -0.0026 0.1020 -0.1756 1.0172 0.0465 -0.0390 -0.1235 3.8120 0.5038 -0.4215 -0.6149 -0.6408 0.4922 -0.4388 -0.5671 -0.5673 0.5092 -0.4435 -0.6030 -0.5633 -0.4770 -0.4847
va: 3.6213 3.7218 4.7771 4.3234 5.3834 5.2743 5.0604 4.9627 4.9034 5.0579 1.3088 1.0164 0.9148 3.6071 5.3267 4.2777 3.9419 1.3203 3.4765 1.6142 3.2089 1.7043 5.5502 5.4789 3.7419 0.8510 1.0680 0.9222 3.5637 1.1116 0.9107 0.8655 3.7813 1.0329 0.8532 0.9461 3.5867 0.8632 0.9088 1.1309 -1.8184 4.1158 1.7726 1.4669 1.4427 4.1524 1.7661 1.1872 1.4485 4.1352 1.7556 1.3500 1.4189 1.1284 1.1428
dispersion: -0.083051377 hartree
energy: -2134.736734141610 hartree
dipole: -25.02035 24.36857 -0.65178 -120.62188 112.38418 -8.23770 -35.61172 33.74062 -1.87110
magnitude: 8.47263 au
magnitude: 21.53572 debye
temp: 298.15 k
press: 1.00 atm
zeropoint: 0.36014054 hartree
thermalvibcorrection: 0.03659490 hartree
thermalrotcorrection: 0.00141627 hartree
thermaltrasncorrection: 0.00141627 hartree
thermaltotal: -2134.33716616 hartree
thermalcorr: 0.03942744 hartree
nonthermalcorr: 0.36014054 hartree
totalcorr: 0.39956798 hartree
thermalcorrenthalpy: 0.00094421 hartree
totalenthalpy: -2134.33622195 hartree
vibrat: 0.06819688 hartree
rotat: 0.01784429 hartree
transl: 0.02159542 hartree
total: 0.10763659 hartree
totalentropycorr: -0.10763659 hartree
gibbsenthalpy: -2134.44385854 hartree
gibbsminuselec: 0.29287560 hartree
