program: Orca
programVersion: 5.0.4
elementType: C C C C C N C C C C H H H C N C C H C O C O N N C H H H C H H H C H H H C H H H Yb N O O O N O O O N O O O H H
elementType: Yb
keywords: def2-SVPD def2/JK def2/J def2-SVPD/C PBE rijcosx rhf hcore XYZFile VeryTightSCF freq cpcm(water) D3 defgrid3
charge: 0
multiplicity: 1
frequency: 0.00 0.00 0.00 0.00 0.00 0.00 16.68 26.13 33.19 39.01 43.66 46.00 53.62 58.76 69.74 77.26 79.57 92.63 96.00 98.90 106.77 112.56 122.27 125.31 135.58 147.54 147.86 151.13 156.90 164.10 171.61 175.62 178.02 181.23 185.40 190.38 193.37 200.66 210.80 214.91 242.26 248.06 257.23 278.34 292.73 300.31 324.16 328.60 338.64 373.28 420.89 424.49 436.33 441.64 458.34 478.47 508.08 542.35 573.26 576.47 586.86 599.08 634.01 649.94 690.80 695.00 699.85 701.77 702.58 704.42 737.55 740.10 745.09 746.46 755.43 756.48 760.47 796.76 797.16 799.05 816.43 835.87 861.95 870.19 875.08 900.36 935.83 961.50 969.67 971.01 979.66 1045.34 1047.66 1057.78 1059.65 1061.37 1072.06 1072.71 1080.60 1089.04 1115.94 1118.14 1121.15 1126.79 1131.31 1136.18 1196.08 1212.07 1217.38 1238.64 1248.55 1252.88 1280.32 1286.10 1294.55 1304.82 1354.02 1358.86 1375.25 1377.39 1381.32 1383.81 1390.06 1394.08 1395.61 1398.83 1400.23 1409.03 1411.94 1412.87 1415.25 1420.95 1423.88 1456.56 1464.69 1472.53 1472.96 1477.25 1493.40 1498.84 1508.25 1564.09 1590.09 1608.89 1613.75 1616.34 1622.50 2976.05 2976.30 2979.80 2980.59 3060.47 3062.14 3066.12 3066.60 3111.62 3115.64 3118.50 3119.29 3123.26 3133.14 3133.56 3136.02 3168.72 3176.27
frequency: 16.68 26.13 33.19 39.01 43.66 46.00 53.62 58.76 69.74 77.26 79.57 92.63 96.00 98.90 106.77 112.56 122.27 125.31 135.58 147.54 147.86 151.13 156.90 164.10 171.61 175.62 178.02 181.23 185.40 190.38 193.37 200.66 210.80 214.91 242.26 248.06 257.23 278.34 292.73 300.31 324.16 328.60 338.64 373.28 420.89 424.49 436.33 441.64 458.34 478.47 508.08 542.35 573.26 576.47 586.86 599.08 634.01 649.94 690.80 695.00 699.85 701.77 702.58 704.42 737.55 740.10 745.09 746.46 755.43 756.48 760.47 796.76 797.16 799.05 816.43 835.87 861.95 870.19 875.08 900.36 935.83 961.50 969.67 971.01 979.66 1045.34 1047.66 1057.78 1059.65 1061.37 1072.06 1072.71 1080.60 1089.04 1115.94 1118.14 1121.15 1126.79 1131.31 1136.18 1196.08 1212.07 1217.38 1238.64 1248.55 1252.88 1280.32 1286.10 1294.55 1304.82 1354.02 1358.86 1375.25 1377.39 1381.32 1383.81 1390.06 1394.08 1395.61 1398.83 1400.23 1409.03 1411.94 1412.87 1415.25 1420.95 1423.88 1456.56 1464.69 1472.53 1472.96 1477.25 1493.40 1498.84 1508.25 1564.09 1590.09 1608.89 1613.75 1616.34 1622.50 2976.05 2976.30 2979.80 2980.59 3060.47 3062.14 3066.12 3066.60 3111.62 3115.64 3118.50 3119.29 3123.26 3133.14 3133.56 3136.02 3168.72 3176.27
formula: C18H18N7O11Yb
InChI: InChI=1/C18H18N4O2.3NO3.Yb/c1-21(2)17(23)13-9-7-11-5-6-12-8-10-14(18(24)22(3)4)20-16(12)15(11)19-13;3*2-1(3)4;/h5-10H,1-4H3;;;;/q-4;3*-2;+10/rC18H18N7O11Yb/c1-19(2)17-13-9-7-11-5-6-12-8-10-14-18(20(3)4)30-37(29-17,23(26,31-37)32-37,24(27,33-37)34-37,25(28,35-37)36-37)21(13)15(11)16(12)22(14)37/h5-10H,1-4H3
55 atoms
C  -0.463635 -0.433138 -4.047916
C  -0.553986 0.937871 -4.272959
C  -0.445888 -0.934113 -2.722823
C  -0.658357 1.813673 -3.165072
C  -0.531173 0.028355 -1.673671
N  -0.648232 1.351127 -1.908055
C  -0.298662 -2.325714 -2.384859
C  -0.186264 -2.731492 -1.074612
C  -0.210907 -1.777412 0.002505
C  -0.409127 -0.397557 -0.297727
H  -0.507079 1.326651 -5.295115
H  -0.257211 -3.059801 -3.20106
H  -0.054738 -3.794237 -0.829494
C  -0.002831 -2.103861 1.365482
N  -0.428152 0.558364 0.649369
C  -0.267672 0.236318 1.937337
C  -0.022746 -1.103304 2.333227
H  0.183986 -1.358464 3.376656
C  -0.607301 3.322596 -3.197795
O  -0.099916 3.884975 -2.182129
C  -0.256134 1.472037 2.805966
O  -0.017224 2.567329 2.215767
N  -1.046943 4.029943 -4.248089
N  -0.469864 1.430513 4.130305
C  -1.900009 3.51154 -5.316006
H  -1.325979 3.374058 -6.252648
H  -2.374449 2.56525 -5.016664
H  -2.698628 4.252213 -5.49912
C  -0.824904 5.474575 -4.267788
H  0.050412 5.727141 -3.650592
H  -0.65484 5.785926 -5.313097
H  -1.715791 6.003865 -3.876173
C  -1.039667 0.302196 4.865079
H  -1.606874 -0.360866 4.194537
H  -0.252869 -0.269455 5.394455
H  -1.7405 0.708534 5.61526
C  -0.274214 2.65099 4.912095
H  -1.241457 3.169051 5.063932
H  0.13894 2.369368 5.896607
H  0.421629 3.322861 4.387961
Yb -0.61431 2.990549 -0.03548
N  2.266506 3.283998 0.016285
O  3.492122 3.40642 0.047015
O  1.480207 4.234054 0.351476
O  1.703857 2.197126 -0.353427
N  -3.434632 2.522446 -0.68197
O  -4.625309 2.362588 -0.960139
O  -2.730191 3.437333 -1.234899
O  -2.829619 1.788865 0.166438
N  -1.943099 5.375404 1.031975
O  -2.519921 6.383761 1.448932
O  -2.206857 4.210087 1.481445
O  -1.047426 5.435052 0.123028
H  0.194515 -3.146092 1.651526
H  -0.372842 -1.128325 -4.89382
elementType: C N H O Yb
totalener: -1943.65321564 hartree
nucrepener: 4687.75417588 hartree
electener: -6631.40739151 hartree
twoeener: 5376.90007022 hartree
cpcmener: -0.09471873 hartree
kineticenergy: 1898.62157293 hartree
exchangeener: -240.291695154536 hartree
correlationener: -9.387042312036 hartree
xcener: -249.678737466572 hartree
chargesum: -0.0000000
charge: 0.220409 -0.510439 -0.986509 -0.229385 -0.110303 0.084139 -0.412811 -0.475574 -0.977945 0.148689 0.055485 0.593172 0.629608 0.148979 -0.192161 -0.120292 -0.507519 0.049577 0.881833 -0.857219 0.889399 -1.020867 -1.378157 -1.318057 0.902258 0.116363 -0.028387 -0.173704 1.030300 -0.112497 -0.075651 0.057989 0.853576 0.027995 0.139658 -0.222555 1.013028 0.036013 -0.029788 -0.130427 2.764392 0.562586 -0.437945 -0.546109 -0.526236 0.542182 -0.453032 -0.492779 -0.508387 0.562118 -0.456253 -0.531328 -0.518527 0.992371 1.038723
charge: 0.110393 0.106158 -0.074301 -0.007152 -0.000203 -0.039781 0.078988 0.078703 -0.074126 -0.006116 0.026726 0.038227 0.038166 0.108086 -0.048992 -0.001188 0.106367 0.020951 -0.037424 -0.299664 -0.008406 -0.303161 -0.198495 -0.200634 0.242471 0.026157 0.005350 0.021980 0.250206 0.004167 0.021694 0.030769 0.241253 0.006499 0.026324 0.020546 0.248432 0.030166 0.022370 0.003036 1.500924 -0.366884 -0.039913 -0.167576 -0.166344 -0.361946 -0.043407 -0.160552 -0.162994 -0.369552 -0.049108 -0.155318 -0.164964 0.046056 0.047035
qa: 0.2204 -0.5104 -0.9865 -0.2294 -0.1103 0.0841 -0.4128 -0.4756 -0.9779 0.1487 0.0555 0.5932 0.6296 0.1490 -0.1922 -0.1203 -0.5075 0.0496 0.8818 -0.8572 0.8894 -1.0209 -1.3782 -1.3181 0.9023 0.1164 -0.0284 -0.1737 1.0303 -0.1125 -0.0757 0.0580 0.8536 0.0280 0.1397 -0.2226 1.0130 0.0360 -0.0298 -0.1304 2.7644 0.5626 -0.4379 -0.5461 -0.5262 0.5422 -0.4530 -0.4928 -0.5084 0.5621 -0.4563 -0.5313 -0.5185 0.9924 1.0387
va: 4.1068 4.4676 5.5359 4.2562 5.0094 4.8614 4.9967 4.9111 5.6678 4.7266 1.6733 1.1231 1.0785 4.0165 5.0513 4.1707 4.6246 1.7513 3.0611 1.5494 2.8288 1.6384 5.4738 5.3893 3.7761 0.8269 1.0414 0.9479 3.5997 1.1062 0.9084 0.8483 3.8218 0.9823 0.8237 0.9853 3.5905 0.8729 0.9017 1.1359 0.2362 4.0533 1.7752 1.4584 1.4137 4.1170 1.7786 1.1808 1.4601 4.0650 1.7738 1.3200 1.4178 0.2464 0.1541
dispersion: -0.082603733 hartree
energy: -1943.735819369495 hartree
dipole: -9.89832 10.64708 0.74875 -118.73261 110.02630 -8.70632 -36.08836 33.87041 -2.21795
magnitude: 9.01554 au
magnitude: 22.91567 debye
temp: 298.15 k
press: 1.00 atm
zeropoint: 0.37762512 hartree
thermalvibcorrection: 0.03399040 hartree
thermalrotcorrection: 0.00141627 hartree
thermaltrasncorrection: 0.00141627 hartree
thermaltotal: -1943.32137130 hartree
thermalcorr: 0.03682295 hartree
nonthermalcorr: 0.37762512 hartree
totalcorr: 0.41444807 hartree
thermalcorrenthalpy: 0.00094421 hartree
totalenthalpy: -1943.32042709 hartree
vibrat: 0.06255585 hartree
rotat: 0.01756488 hartree
transl: 0.02158908 hartree
total: 0.10170981 hartree
totalentropycorr: -0.10170981 hartree
gibbsenthalpy: -1943.42213690 hartree
gibbsminuselec: 0.31368247 hartree
