program: Orca
programVersion: 5.0.4
elementType: C C C C C N C C C C H H H C N C C H C O C O N N C H H H C H H H C H H H C H H H Ho N O O O N O O O N O O O H H
elementType: Ho
keywords: def2-SVPD def2/JK def2/J def2-SVPD/C PBE rijcosx rhf hcore XYZFile VeryTightSCF freq cpcm(water) D3 defgrid3
charge: 0
multiplicity: 1
frequency: 0.00 0.00 0.00 0.00 0.00 0.00 15.39 24.83 29.26 37.78 42.17 43.46 51.22 55.51 71.29 75.33 79.07 90.50 96.04 98.94 102.81 109.15 117.62 121.40 131.00 140.02 144.36 151.08 158.55 164.84 167.39 171.79 176.15 180.22 185.24 189.49 191.90 198.05 206.61 216.63 240.00 245.79 255.45 276.42 290.88 297.89 323.03 328.60 337.65 371.65 418.52 422.71 433.86 438.79 454.86 476.78 503.80 538.97 572.60 577.85 586.77 598.64 633.98 649.60 690.54 694.69 700.75 702.52 703.00 704.76 735.97 738.49 743.43 744.99 755.10 755.84 759.66 797.63 797.76 799.17 815.84 835.16 861.10 868.19 874.85 899.81 935.41 960.73 968.95 970.72 979.48 1044.60 1047.43 1055.78 1058.19 1060.07 1071.83 1072.79 1080.01 1087.81 1116.06 1118.32 1120.14 1125.24 1130.05 1135.32 1196.12 1211.70 1217.68 1238.43 1248.16 1252.71 1279.13 1281.72 1290.36 1300.90 1353.56 1358.71 1374.98 1377.17 1381.54 1384.20 1389.82 1393.84 1395.51 1398.00 1400.12 1407.60 1412.08 1412.98 1414.62 1420.43 1423.29 1456.09 1462.91 1472.83 1473.44 1476.38 1492.55 1499.48 1508.28 1563.47 1590.33 1608.56 1612.80 1616.54 1622.23 2976.10 2976.70 2979.87 2980.72 3059.12 3061.82 3065.33 3066.10 3111.29 3114.76 3118.20 3120.34 3123.24 3132.95 3133.43 3136.03 3164.70 3173.56
frequency: 15.39 24.83 29.26 37.78 42.17 43.46 51.22 55.51 71.29 75.33 79.07 90.50 96.04 98.94 102.81 109.15 117.62 121.40 131.00 140.02 144.36 151.08 158.55 164.84 167.39 171.79 176.15 180.22 185.24 189.49 191.90 198.05 206.61 216.63 240.00 245.79 255.45 276.42 290.88 297.89 323.03 328.60 337.65 371.65 418.52 422.71 433.86 438.79 454.86 476.78 503.80 538.97 572.60 577.85 586.77 598.64 633.98 649.60 690.54 694.69 700.75 702.52 703.00 704.76 735.97 738.49 743.43 744.99 755.10 755.84 759.66 797.63 797.76 799.17 815.84 835.16 861.10 868.19 874.85 899.81 935.41 960.73 968.95 970.72 979.48 1044.60 1047.43 1055.78 1058.19 1060.07 1071.83 1072.79 1080.01 1087.81 1116.06 1118.32 1120.14 1125.24 1130.05 1135.32 1196.12 1211.70 1217.68 1238.43 1248.16 1252.71 1279.13 1281.72 1290.36 1300.90 1353.56 1358.71 1374.98 1377.17 1381.54 1384.20 1389.82 1393.84 1395.51 1398.00 1400.12 1407.60 1412.08 1412.98 1414.62 1420.43 1423.29 1456.09 1462.91 1472.83 1473.44 1476.38 1492.55 1499.48 1508.28 1563.47 1590.33 1608.56 1612.80 1616.54 1622.23 2976.10 2976.70 2979.87 2980.72 3059.12 3061.82 3065.33 3066.10 3111.29 3114.76 3118.20 3120.34 3123.24 3132.95 3133.43 3136.03 3164.70 3173.56
formula: C18H18HoN7O11
InChI: InChI=1/C18H18N4O2.Ho.3NO3/c1-21(2)17(23)13-9-7-11-5-6-12-8-10-14(18(24)22(3)4)20-16(12)15(11)19-13;;3*2-1(3)4/h5-10H,1-4H3;;;;/q-4;+10;3*-2/rC18H18HoN7O11/c1-20(2)17-13-9-7-11-5-6-12-8-10-14-18(21(3)4)31-19(30-17,32-24(27)33-19,34-25(28)35-19,36-26(29)37-19)22(13)15(11)16(12)23(14)19/h5-10H,1-4H3
55 atoms
C  -0.431773 -0.437225 -4.053545
C  -0.534049 0.932194 -4.281169
C  -0.407615 -0.935005 -2.727219
C  -0.640113 1.807956 -3.173801
C  -0.495283 0.028286 -1.678282
N  -0.619545 1.350155 -1.915475
C  -0.254688 -2.325861 -2.389719
C  -0.144359 -2.731565 -1.079533
C  -0.176593 -1.778123 -0.00236
C  -0.374736 -0.397491 -0.301663
H  -0.494954 1.32213 -5.303688
H  -0.209184 -3.059169 -3.20642
H  -0.010509 -3.793888 -0.833813
C  0.021687 -2.108439 1.36113
N  -0.400924 0.556253 0.648159
C  -0.254638 0.228538 1.936343
C  -0.011479 -1.111301 2.331517
H  0.184175 -1.366838 3.377188
C  -0.603077 3.316435 -3.218718
O  -0.056704 3.891402 -2.230952
C  -0.257109 1.454959 2.817436
O  0.020364 2.553891 2.250932
N  -1.100255 4.007633 -4.253684
N  -0.526642 1.397805 4.130772
C  -2.000151 3.46705 -5.271004
H  -1.477864 3.345284 -6.239342
H  -2.43091 2.508187 -4.946682
H  -2.827653 4.18631 -5.406424
C  -0.899363 5.454584 -4.298147
H  -0.002346 5.72539 -3.721139
H  -0.777785 5.756904 -5.352915
H  -1.780144 5.976267 -3.874795
C  -1.138649 0.265455 4.824545
H  -1.677331 -0.386207 4.120158
H  -0.382174 -0.317113 5.38502
H  -1.872062 0.669016 5.54459
C  -0.351667 2.603624 4.939388
H  -1.32329 3.117615 5.075907
H  0.036029 2.304421 5.929214
H  0.356302 3.28547 4.44551
Ho -0.556184 3.025649 -0.030001
N  2.359409 3.273682 0.022324
O  3.586257 3.377825 0.057564
O  1.587595 4.235935 0.360143
O  1.782707 2.196481 -0.354679
N  -3.417734 2.58868 -0.621479
O  -4.616619 2.440362 -0.867958
O  -2.710493 3.469517 -1.22366
O  -2.809101 1.874584 0.242284
N  -1.823734 5.504174 0.989816
O  -2.376701 6.534338 1.386075
O  -2.097872 4.358606 1.484351
O  -0.94681 5.521987 0.061962
H  0.21887 -3.151296 1.645025
H  -0.338777 -1.13435 -4.897631
elementType: C N H O Ho
totalener: -1941.90810403 hartree
nucrepener: 4665.35217926 hartree
electener: -6607.26028328 hartree
twoeener: 5353.29288114 hartree
cpcmener: -0.09470939 hartree
kineticenergy: 1897.70674611 hartree
exchangeener: -240.106376726244 hartree
correlationener: -9.380269830776 hartree
xcener: -249.486646557020 hartree
chargesum: -0.0000000
charge: 0.238017 -0.492448 -0.991263 -0.227138 -0.165729 0.080308 -0.421910 -0.452473 -0.992691 0.125879 0.045449 0.605414 0.662971 0.147049 -0.175421 -0.159054 -0.475897 0.052013 0.856953 -0.899244 0.864514 -1.033762 -1.396830 -1.326481 0.918602 0.098556 -0.039340 -0.154298 1.042340 -0.112098 -0.074458 0.055870 0.859090 0.024806 0.130861 -0.217340 1.012615 0.036046 -0.025340 -0.134447 3.036704 0.555461 -0.436099 -0.580537 -0.567709 0.534222 -0.449213 -0.512170 -0.524197 0.552097 -0.452772 -0.544872 -0.516586 0.981174 1.034806
charge: 0.109225 0.104329 -0.075261 -0.010429 0.000343 -0.039768 0.077970 0.077732 -0.075139 -0.004664 0.028971 0.038094 0.038070 0.107175 -0.047162 -0.003874 0.104642 0.022100 -0.041288 -0.299959 -0.010980 -0.305157 -0.199519 -0.201326 0.241736 0.025388 0.004953 0.021949 0.249148 0.004044 0.021311 0.030065 0.240316 0.006592 0.025802 0.020327 0.247593 0.029643 0.022365 0.002237 1.535383 -0.368162 -0.039338 -0.167860 -0.166678 -0.362562 -0.043016 -0.160866 -0.164306 -0.371671 -0.050909 -0.157418 -0.162860 0.045884 0.046783
qa: 0.2380 -0.4924 -0.9913 -0.2271 -0.1657 0.0803 -0.4219 -0.4525 -0.9927 0.1259 0.0454 0.6054 0.6630 0.1470 -0.1754 -0.1591 -0.4759 0.0520 0.8570 -0.8992 0.8645 -1.0338 -1.3968 -1.3265 0.9186 0.0986 -0.0393 -0.1543 1.0423 -0.1121 -0.0745 0.0559 0.8591 0.0248 0.1309 -0.2173 1.0126 0.0360 -0.0253 -0.1344 3.0367 0.5555 -0.4361 -0.5805 -0.5677 0.5342 -0.4492 -0.5122 -0.5242 0.5521 -0.4528 -0.5449 -0.5166 0.9812 1.0348
va: 4.1411 4.4608 5.5183 4.3053 5.1195 4.8668 5.0200 4.9259 5.6663 4.7961 1.6418 1.1022 1.0242 4.0739 5.0154 4.2901 4.6122 1.7177 3.1171 1.5744 2.9175 1.6956 5.4988 5.4105 3.7638 0.8392 1.0558 0.9348 3.5978 1.1089 0.9070 0.8497 3.8172 0.9923 0.8287 0.9781 3.5986 0.8712 0.9005 1.1343 -0.3918 4.0581 1.7809 1.4377 1.4634 4.1157 1.7810 1.1838 1.4756 4.0768 1.7662 1.3154 1.4084 0.2754 0.1598
dispersion: -0.082384319 hartree
energy: -1941.990488347441 hartree
dipole: -14.23462 14.65070 0.41608 -117.01631 108.07995 -8.93636 -35.17955 32.94878 -2.23077
magnitude: 9.21998 au
magnitude: 23.43532 debye
temp: 298.15 k
press: 1.00 atm
zeropoint: 0.37725067 hartree
thermalvibcorrection: 0.03416099 hartree
thermalrotcorrection: 0.00141627 hartree
thermaltrasncorrection: 0.00141627 hartree
thermaltotal: -1941.57624414 hartree
thermalcorr: 0.03699353 hartree
nonthermalcorr: 0.37725067 hartree
totalcorr: 0.41424421 hartree
thermalcorrenthalpy: 0.00094421 hartree
totalenthalpy: -1941.57529993 hartree
vibrat: 0.06308271 hartree
rotat: 0.01757957 hartree
transl: 0.02157212 hartree
total: 0.10223441 hartree
totalentropycorr: -0.10223441 hartree
gibbsenthalpy: -1941.67753434 hartree
gibbsminuselec: 0.31295401 hartree
